Diethyl selenide
- Formula: C4H10Se
- Molecular weight: 137.08
- IUPAC Standard InChIKey: ALCDAWARCQFJBA-UHFFFAOYSA-N
- CAS Registry Number: 627-53-2
- Chemical structure:
View 3d structure (requires JavaScript / HTML 5) - Other names: Ethyl selenide; Ethane, 1,1'-selenobis-; Diethyl monoselenide; Diethyl selenium; (C2H5)2Se; Selenide, diethyl-; TL 264

Phase change data

Data compiled by: William E. Acree, Jr., James S. Chickos
Quantity | Value | Units | Method | Reference | Comment |
---|---|---|---|---|---|
ΔvapH° | 38.9 ± 1.0 | kJ/mol | C | Voronkov, Klyuchnikov, et al., 1989 |
Enthalpy of vaporization
ΔvapH (kJ/mol) | Temperature (K) | Reference | Comment |
---|---|---|---|
39.7 | 258. | Dykyj, Svoboda, et al., 1999 | Based on data from 243. to 381. K. |
36.8 | 303. | Tanaka and Nagai, 1929 | Based on data from 298. to 308. K. |

Gas phase ion energetics data

Data compiled as indicated in comments:
RDSH - Henry M. Rosenstock, Keith Draxl, Bruce W. Steiner, and John T. Herron
Ionization energy determinations
IE (eV) | Method | Reference | Comment |
---|---|---|---|
8.3 ± 0.3 | EI | Bogolyubov, Grishin, et al., 1969 | RDSH |
Appearance energy determinations
Ion | AE (eV) | Other Products | Method | Reference | Comment |
---|---|---|---|---|---|
C2H3+ | 19.0 ± 0.3 | ? | EI | Bogolyubov, Grishin, et al., 1969 | RDSH |
C2H4+ | 15.1 ± 0.3 | ? | EI | Bogolyubov, Grishin, et al., 1969 | RDSH |
C2H5+ | 13.2 ± 0.3 | ? | EI | Bogolyubov, Grishin, et al., 1969 | RDSH |
C2H5Se+ | 11.9 ± 0.3 | ? | EI | Bogolyubov, Grishin, et al., 1969 | RDSH |
C2H6Se+ | 10.6 ± 0.3 | ? | EI | Bogolyubov, Grishin, et al., 1969 | RDSH |
C3H7Se+ | 10.5 ± 0.3 | CH3 | EI | Bogolyubov, Grishin, et al., 1969 | RDSH |
H2Se+ | 12.8 ± 0.3 | ? | EI | Bogolyubov, Grishin, et al., 1969 | RDSH |

References

Voronkov, Klyuchnikov, et al., 1989
Voronkov, M.G.; Klyuchnikov, V.A.; Kolabin, S.N.; Shvets, G.N.; Varushin, P.I.; Deryagina, E.N.; Korchevin, N.A.; Tsvetnitskaya, S.I.,
Thermochemical properties of dialkyl chalcogenides and dichalcogenides RMnR (M = sulfur, selenium, tellurium; n = 1, 2),
Dokl. Akad. Nauk SSSR, Phys. Chem., 1989, 307, 5, 1139. [all data]
Dykyj, Svoboda, et al., 1999
Dykyj, J.; Svoboda, J.; Wilhoit, R.C.; Frenkel, M.L.; Hall, K.R.,
Vapor Pressure of Chemicals: Part A. Vapor Pressure and Antoine Constants for Hydrocarbons and Sulfur, Selenium, Tellurium and Hydrogen Containing Organic Compounds, Springer, Berlin, 1999, 373. [all data]
Tanaka and Nagai, 1929
Tanaka, Y.; Nagai, Y.,
Proc. Imp. Acad. (Tokyo), 1929, 5, 78. [all data]
Bogolyubov, Grishin, et al., 1969
Bogolyubov, G.M.; Grishin, N.N.; Petrov, A.A.,
Organic derivatives of group V and group VI elements. X. Mass spectra of tetraethyldistibine, diethyl diselenide, diethyl ditelluride, and the corresponding monoderivatives. Interpretation of mass-spectral intensities,
Zh. Obshch. Khim., 1969, 39, 2244, In original 2190. [all data]