Divinyl sulfide
- Formula: C4H6S
- Molecular weight: 86.155
- IUPAC Standard InChIKey: UIYCHXAGWOYNNA-UHFFFAOYSA-N
- CAS Registry Number: 627-51-0
- Chemical structure:
View 3d structure (requires JavaScript / HTML 5) - Other names: Ethene, 1,1'-thiobis-; Vinyl sulfide; Divinyl thioether; (CH2=CH)2S

Gas phase thermochemistry data

Data compiled by: Hussein Y. Afeefy, Joel F. Liebman, and Stephen E. Stein
Quantity | Value | Units | Method | Reference | Comment |
---|---|---|---|---|---|
ΔfH°gas | 106.0 ± 4.0 | kJ/mol | Ccb | Voronkov, Klyuchnikov, et al., 1989 |

Condensed phase thermochemistry data

Data compiled by: Hussein Y. Afeefy, Joel F. Liebman, and Stephen E. Stein
Quantity | Value | Units | Method | Reference | Comment |
---|---|---|---|---|---|
ΔfH°liquid | 67.7 ± 3.0 | kJ/mol | Ccb | Voronkov, Klyuchnikov, et al., 1989 |

Phase change data

Data compiled as indicated in comments:
AC - William E. Acree, Jr., James S. Chickos
ALS - Hussein Y. Afeefy, Joel F. Liebman, and Stephen E. Stein
DRB - Donald R. Burgess, Jr.
Quantity | Value | Units | Method | Reference | Comment |
---|---|---|---|---|---|
ΔvapH° | 38.3 ± 0.7 | kJ/mol | C | Voronkov, Klyuchnikov, et al., 1989, 2 | AC |
ΔvapH° | 38.3 ± 0.7 | kJ/mol | C | Voronkov, Klyuchnikov, et al., 1989 | ALS |
ΔvapH° | 38.3 | kJ/mol | N/A | Voronkov, Klyuchnikov, et al., 1989 | DRB |

Gas phase ion energetics data

Data compiled as indicated in comments:
LLK - Sharon G. Lias, Rhoda D. Levin, and Sherif A. Kafafi
Ionization energy determinations
IE (eV) | Method | Reference | Comment |
---|---|---|---|
8.25 ± 0.01 | PI | Trofimov, Mel'der, et al., 1975 | LLK |
8.42 | PE | Weiner and Lattman, 1978 | Vertical value; LLK |

Normal alkane RI, non-polar column, temperature ramp

Column type | Active phase | I | Reference | Comment |
---|---|---|---|---|
Capillary | OV-101 | 647. | Zenkevich, 2005 | 25. m/0.20 mm/0.10 μm, N2/He, 6. K/min; Tstart: 50. C; Tend: 250. C |

References

Voronkov, Klyuchnikov, et al., 1989
Voronkov, M.G.; Klyuchnikov, V.A.; Kolabin, S.N.; Shvets, G.N.; Varusin, P.I.; Deryagina, E.N.; Korchevin, N.A.; Tsvetnitskaya, S.I.,
Thermochemical properties of diorganyl chalcogenides and dichalcogenides RMnR(M = S, Se, Te; n = 1, 2).,
Dokl. Phys. Chem. (Engl. Transl.), 1989, 307, 650-653, In original 1139. [all data]
Voronkov, Klyuchnikov, et al., 1989, 2
Voronkov, M.G.; Klyuchnikov, V.A.; Kolabin, S.N.; Shvets, G.N.; Varushin, P.I.; Deryagina, E.N.; Korchevin, N.A.; Tsvetnitskaya, S.I.,
Thermochemical properties of dialkyl chalcogenides and dichalcogenides RMnR (M = sulfur, selenium, tellurium; n = 1, 2),
Dokl. Akad. Nauk SSSR, Phys. Chem., 1989, 307, 5, 1139. [all data]
Trofimov, Mel'der, et al., 1975
Trofimov, B.A.; Mel'der, U.K.; Pikver, R.I.; Vyalykh, E.P.,
Ionization potentials of unsaturated and sulfides the participation of neighboring multiple bonds of heteroatoms in the stabilization of the radical cation,
Teor. Eksp. Khim., 1975, 11, 129. [all data]
Weiner and Lattman, 1978
Weiner, M.A.; Lattman, M.,
Ultraviolet photoelectron spectra of some Cr(CO)5L complexes containing organosulfide and organophosphine ligands,
Inorg. Chem., 1978, 17, 1084. [all data]
Zenkevich, 2005
Zenkevich, I.G.,
Experimentally measured retention indices., 2005. [all data]