N-Ethylformamide
- Formula: C3H7NO
- Molecular weight: 73.0938
- IUPAC Standard InChIKey: KERBAAIBDHEFDD-UHFFFAOYSA-N
- CAS Registry Number: 627-45-2
- Chemical structure:
View 3d structure (requires JavaScript / HTML 5) - Other names: N-Formylethylamine; Formamide, N-ethyl-; Ethylformamide; N-Aethylformamid; Formamide, ethyl-

Phase change data

Data compiled as indicated in comments:
BS - Robert L. Brown and Stephen E. Stein
AC - William E. Acree, Jr., James S. Chickos
Quantity | Value | Units | Method | Reference | Comment |
---|---|---|---|---|---|
Tboil | 471.2 | K | N/A | Weast and Grasselli, 1989 | BS |
Quantity | Value | Units | Method | Reference | Comment |
ΔvapH° | 58.44 | kJ/mol | N/A | Majer and Svoboda, 1985 | |
ΔvapH° | 58.4 | kJ/mol | A | Barone, Castronuovo, et al., 1985 | See also Majer and Svoboda, 1985, 2.; AC |

Gas phase ion energetics data

Data compiled by: Sharon G. Lias, Rhoda D. Levin, and Sherif A. Kafafi
Appearance energy determinations
Ion | AE (eV) | Other Products | Method | Reference | Comment |
---|---|---|---|---|---|
C2H6N+ | 9.7 ± 0.15 | HCO | EI | Solka and Russell, 1974 |

Kovats' RI, non-polar column, isothermal

Column type | Active phase | Temperature (C) | I | Reference | Comment |
---|---|---|---|---|---|
Packed | SE-30 | 180. | 794. | Krawczyk and Piotrowski, 1989 | N2, Chromosorb W AW; Column length: 1. m |

References

Weast and Grasselli, 1989
CRC Handbook of Data on Organic Compounds, 2nd Editon, Weast,R.C and Grasselli, J.G., ed(s)., CRC Press, Inc., Boca Raton, FL, 1989, 1. [all data]
Majer and Svoboda, 1985
Majer, V.; Svoboda, V.,
Enthalpies of Vaporization of Organic Compounds: A Critical Review and Data Compilation, Blackwell Scientific Publications, Oxford, 1985, 300. [all data]
Barone, Castronuovo, et al., 1985
Barone, G.; Castronuovo, G.; Della Gatta, G.; Elia, V.; Iannone, A.,
Enthalpies of vaporization of seven alkylamides,
Fluid Phase Equilibria, 1985, 21, 1-2, 157-164, https://doi.org/10.1016/0378-3812(85)90066-4
. [all data]
Majer and Svoboda, 1985, 2
Majer, V.; Svoboda, V.,
Enthalpies of Vaporization of Organic Compounds: A Critical Review and Data Compilation, Blackwell Scientific Publications, Oxford, 1985, 300. [all data]
Solka and Russell, 1974
Solka, B.H.; Russell, M.E.,
Energetics of formation of some structural isomers of gaseous C2H5O+ C2H6N+ ions,
J. Phys. Chem., 1974, 78, 1268. [all data]
Krawczyk and Piotrowski, 1989
Krawczyk, W.; Piotrowski, G.T.,
Relationships Between Structure and Retention Index for N-Substituted Amides of Aliphatic Acids on a Non-Polar Column,
J. Chromatogr., 1989, 463, 297-304, https://doi.org/10.1016/S0021-9673(01)84484-8
. [all data]