Ether, 2-fluoroethyl methyl
- Formula: C3H7FO
- Molecular weight: 78.0855
- IUPAC Standard InChIKey: FQVSGUBAZSXHFZ-UHFFFAOYSA-N
- CAS Registry Number: 627-43-0
- Chemical structure:
View 3d structure (requires JavaScript / HTML 5) - Permanent link for this species. Use this link for bookmarking this species for future reference.

Gas phase ion energetics data

Data compiled by: Sharon G. Lias, Rhoda D. Levin, and Sherif A. Kafafi
Ionization energy determinations
IE (eV) | Method | Reference | Comment |
---|---|---|---|
10.18 | PE | Hoppilliard and Solgadi, 1980 | Vertical value |

References

Hoppilliard and Solgadi, 1980
Hoppilliard, Y.; Solgadi, D.,
Conformational analysis of 2-haloethanols and 2-methoxyethylhalides in a photoelectron spectrometer,
Tetrahedron, 1980, 36, 377. [all data]