Methyl propargyl ether
- Formula: C4H6O
- Molecular weight: 70.0898
- IUPAC Standard InChIKey: YACFFSVYSPMSGS-UHFFFAOYSA-N
- CAS Registry Number: 627-41-8
- Chemical structure:
View 3d structure (requires JavaScript / HTML 5) - Other names: HC≡CCH2OCH3; 1-Propyne, 3-methoxy-; Ether, methyl 2-propynyl; 3-Methoxypropyne; 3-Methoxy-1-propyne; Propargyl methyl ether; Methyl 2-propynyl ether; 3-Methoxyprop-1-yne

Phase change data

Data compiled by: Robert L. Brown and Stephen E. Stein
Quantity | Value | Units | Method | Reference | Comment |
---|---|---|---|---|---|
Tboil | 334.7 | K | N/A | Aldrich Chemical Company Inc., 1990 |

Gas phase ion energetics data

Data compiled as indicated in comments:
LBLHLM - Sharon G. Lias, John E. Bartmess, Joel F. Liebman, John L. Holmes, Rhoda D. Levin, and W. Gary Mallard
Ionization energy determinations
IE (eV) | Method | Reference | Comment |
---|---|---|---|
9.78 | EI | Holmes and Lossing, 1986 | LBLHLM |

References

Aldrich Chemical Company Inc., 1990
Aldrich Chemical Company Inc.,
Catalog Handbook of Fine Chemicals, Aldrich Chemical Company, Inc., Milwaukee WI, 1990, 1. [all data]
Holmes and Lossing, 1986
Holmes, J.L.; Lossing, F.P.,
Title unavailable,
Personal communication to S.G. Lias, 1986. [all data]