Propane, 1-isocyano-
- Formula: C4H7N
- Molecular weight: 69.1051
- IUPAC Standard InChIKey: FFDKYFGBIQQMSR-UHFFFAOYSA-N
- CAS Registry Number: 627-36-1
- Chemical structure:
View 3d structure (requires JavaScript / HTML 5) - Other names: Propyl isocyanide; n-Propyl isocyanide; Propylisonitrile; n-C3H7NC

Condensed phase thermochemistry data

Data compiled by: Hussein Y. Afeefy, Joel F. Liebman, and Stephen E. Stein
Quantity | Value | Units | Method | Reference | Comment |
---|---|---|---|---|---|
ΔcH°liquid | -2673. | kJ/mol | Ccb | Lemoult and Jungfleisch, 1909 |

Gas phase ion energetics data

Data evaluated as indicated in comments:
HL - Edward P. Hunter and Sharon G. Lias
Data compiled as indicated in comments:
LBLHLM - Sharon G. Lias, John E. Bartmess, Joel F. Liebman, John L. Holmes, Rhoda D. Levin, and W. Gary Mallard
RDSH - Henry M. Rosenstock, Keith Draxl, Bruce W. Steiner, and John T. Herron
Quantity | Value | Units | Method | Reference | Comment |
---|---|---|---|---|---|
Proton affinity (review) | 856.8 | kJ/mol | N/A | Hunter and Lias, 1998 | HL |
Quantity | Value | Units | Method | Reference | Comment |
Gas basicity | 824.3 | kJ/mol | N/A | Hunter and Lias, 1998 | HL |
Ionization energy determinations
IE (eV) | Method | Reference | Comment |
---|---|---|---|
11.8 ± 0.25 | EI | Chess, Lapp, et al., 1982 | LBLHLM |
11.33 | EI | Heerma and deRidder, 1970 | RDSH |
11.1 ± 0.1 | EI | Gillis and Occolowitz, 1963 | RDSH |
Appearance energy determinations
Ion | AE (eV) | Other Products | Method | Reference | Comment |
---|---|---|---|---|---|
C2H3N+ | 12.05 | ? | EI | Heerma and deRidder, 1970 | RDSH |
C3H4N+ | 12.09 | ? | EI | Heerma and deRidder, 1970 | RDSH |
C3H5+ | 13.18 | ? | EI | Heerma and deRidder, 1970 | RDSH |
C3H6+ | 12.13 | ? | EI | Heerma and deRidder, 1970 | RDSH |
C3H7+ | 12.43 | CN | EI | Heerma and deRidder, 1970 | RDSH |
C4H6N+ | 11.96 | H | EI | Heerma and deRidder, 1970 | RDSH |

References

Lemoult and Jungfleisch, 1909
Lemoult, M.P.; Jungfleisch, M.E.,
Thermochimie. - Comparaisons entre les nitriles et les carbylamines,
Compt. Rend., 1909, 148, 1602-1604. [all data]
Hunter and Lias, 1998
Hunter, E.P.; Lias, S.G.,
Evaluated Gas Phase Basicities and Proton Affinities of Molecules: An Update,
J. Phys. Chem. Ref. Data, 1998, 27, 3, 413-656, https://doi.org/10.1063/1.556018
. [all data]
Chess, Lapp, et al., 1982
Chess, E.K.; Lapp, R.L.; Gross, M.L.,
The question of tautomerism of alkylnitrile and isonitrile radical cations,
Org. Mass Spectrom., 1982, 17, 475. [all data]
Heerma and deRidder, 1970
Heerma, W.; deRidder, J.J.,
The electron-impact induced fragmentation of some alkyl isocyanides and alpha-branched alkyl cyanides,
Org. Mass Spectrom., 1970, 3, 1439. [all data]
Gillis and Occolowitz, 1963
Gillis, R.G.; Occolowitz, J.L.,
Isocyanides. III. Electron impact study of aliphatic isocyanides,
J. Org. Chem., 1963, 28, 2924. [all data]