1-Iodo-2-butene
- Formula: C4H7I
- Molecular weight: 182.0028
- IUPAC Standard InChIKey: LOPHPAWGOMDGMA-NSCUHMNNSA-N
- CAS Registry Number: 627-24-7
- Chemical structure:
View 3d structure (requires JavaScript / HTML 5) - Permanent link for this species. Use this link for bookmarking this species for future reference.

Gas phase ion energetics data

Data compiled by: Henry M. Rosenstock, Keith Draxl, Bruce W. Steiner, and John T. Herron
Appearance energy determinations
Ion | AE (eV) | Other Products | Method | Reference | Comment |
---|---|---|---|---|---|
C4H7+ | 9.15 ± 0.05 | I | EI | McDowell, Lossing, et al., 1956 |

References

McDowell, Lossing, et al., 1956
McDowell, C.A.; Lossing, F.P.; Henderson, I.H.S.; Farmer, J.B.,
Free radicals by mass spectrometry. X. The ionization potentials of methyl substituted allyl radicals,
Can. J. Chem., 1956, 34, 345. [all data]