2-Pentene, (Z)-
- Formula: C5H10
- Molecular weight: 70.1329
- IUPAC Standard InChIKey: QMMOXUPEWRXHJS-HYXAFXHYSA-N
- CAS Registry Number: 627-20-3
- Chemical structure:
View 3d structure (requires JavaScript / HTML 5) - Stereoisomers:
- Other names: (Z)-2-Pentene; cis-β-Amylene; cis-Pentene; cis-2-Pentene; 2-(Z)-C5H10; cis-Pentene-2; Pentene-2, cis-; (Z)-pent-2-ene

Gas phase thermochemistry data

Data compiled as indicated in comments:
DRB - Donald R. Burgess, Jr.
ALS - Hussein Y. Afeefy, Joel F. Liebman, and Stephen E. Stein
GT - Glushko Thermocenter, Russian Academy of Sciences, Moscow
Quantity | Value | Units | Method | Reference | Comment |
---|---|---|---|---|---|
ΔfH°gas | -28. ± 4. | kJ/mol | AVG | N/A | Average of 7 values; Individual data points |
Constant pressure heat capacity of gas
Cp,gas (J/mol*K) | Temperature (K) | Reference | Comment |
---|---|---|---|
98.8 | 298.15 | Thermodynamics Research Center, 1997 | p=1 bar. Recommended values were calculated from data for lower alkenes by a method of increments. These values are in good agreement with experimental data (see also [ Kilpatrick J.E., 1946]).; GT |
99.3 | 300. | ||
128.3 | 400. | ||
155.6 | 500. | ||
179.4 | 600. | ||
199.2 | 700. | ||
216.5 | 800. | ||
231.4 | 900. | ||
244.3 | 1000. | ||
255.3 | 1100. | ||
265.0 | 1200. | ||
273.3 | 1300. | ||
280.6 | 1400. | ||
286.90 | 1500. |

Condensed phase thermochemistry data

Data compiled as indicated in comments:
ALS - Hussein Y. Afeefy, Joel F. Liebman, and Stephen E. Stein
DRB - Donald R. Burgess, Jr.
DH - Eugene S. Domalski and Elizabeth D. Hearing
Quantity | Value | Units | Method | Reference | Comment |
---|---|---|---|---|---|
ΔfH°liquid | -53.35 ± 0.42 | kJ/mol | Eqk | Wiberg, Wasserman, et al., 1984 | Trifluoroacetolysis, hrxn[kcal/mol]=-10.92±0.01; ALS |
ΔfH°liquid | -53.49 ± 0.62 | kJ/mol | Ccb | Good and Smith, 1979 | ALS |
ΔfH°liquid | -55.8 ± 1.0 | kJ/mol | Chyd | N/A | DRB |
ΔfH°liquid | -60.0 ± 0.3 | kJ/mol | Cm | Coops, Mulder, et al., 1946 | DRB |
Quantity | Value | Units | Method | Reference | Comment |
ΔcH°liquid | -3343.21 ± 0.54 | kJ/mol | Ccb | Good and Smith, 1979 | Corresponding ΔfHºliquid = -53.49 kJ/mol (simple calculation by NIST; no Washburn corrections); ALS |
ΔcH°liquid | -3336.7 ± 0.3 | kJ/mol | Cm | Coops, Mulder, et al., 1946 | Reanalyzed by Cox and Pilcher, 1970, Original value = -3335.3 ± 0.3 kJ/mol; Corresponding ΔfHºliquid = -60.04 kJ/mol (simple calculation by NIST; no Washburn corrections); ALS |
Quantity | Value | Units | Method | Reference | Comment |
S°liquid | 258.8 | J/mol*K | N/A | Chao, Hall, et al., 1983 | DH |
S°liquid | 258.61 | J/mol*K | N/A | Todd, Oliver, et al., 1947 | DH |
Constant pressure heat capacity of liquid
Cp,liquid (J/mol*K) | Temperature (K) | Reference | Comment |
---|---|---|---|
151.8 | 298.15 | Chao, Hall, et al., 1983 | T = 13 to 295 K.; DH |
151.71 | 298.15 | Todd, Oliver, et al., 1947 | T = 12 to 300 K.; DH |

Phase change data

Data compiled as indicated in comments:
BS - Robert L. Brown and Stephen E. Stein
TRC - Thermodynamics Research Center, NIST Boulder Laboratories, Chris Muzny director
AC - William E. Acree, Jr., James S. Chickos
DH - Eugene S. Domalski and Elizabeth D. Hearing
Quantity | Value | Units | Method | Reference | Comment |
---|---|---|---|---|---|
Tboil | 309.8 ± 0.6 | K | AVG | N/A | Average of 23 out of 25 values; Individual data points |
Quantity | Value | Units | Method | Reference | Comment |
Tfus | 120.67 | K | N/A | Hoff, Greenlee, et al., 1951 | Uncertainty assigned by TRC = 0.5 K; TRC |
Tfus | 121.77 | K | N/A | Hoff, Greenlee, et al., 1951 | Uncertainty assigned by TRC = 0.1 K; TRC |
Tfus | 120.59 | K | N/A | Hoff, Greenlee, et al., 1951 | Uncertainty assigned by TRC = 0.1 K; TRC |
Tfus | 121.74 | K | N/A | Streiff, Murphy, et al., 1946 | Uncertainty assigned by TRC = 0.05 K; TRC |
Tfus | 121.78 | K | N/A | Streiff, Murphy, et al., 1946 | Uncertainty assigned by TRC = 0.04 K; TRC |
Quantity | Value | Units | Method | Reference | Comment |
Ttriple | 121.78 | K | N/A | Chao, Hall, et al., 1983, 2 | Uncertainty assigned by TRC = 0.02 K; TRC |
Ttriple | 121.80 | K | N/A | Todd, Oliver, et al., 1947, 2 | Uncertainty assigned by TRC = 0.02 K; TRC |
Quantity | Value | Units | Method | Reference | Comment |
Tc | 475. ± 1. | K | N/A | Tsonopoulos and Ambrose, 1996 | |
Quantity | Value | Units | Method | Reference | Comment |
Pc | 36.9 ± 1.0 | bar | N/A | Tsonopoulos and Ambrose, 1996 | |
Quantity | Value | Units | Method | Reference | Comment |
ΔvapH° | 26.8 | kJ/mol | N/A | Reid, 1972 | AC |
Enthalpy of vaporization
ΔvapH (kJ/mol) | Temperature (K) | Method | Reference | Comment |
---|---|---|---|---|
29.8 | 249. | A | Stephenson and Malanowski, 1987 | Based on data from 234. to 318. K.; AC |
28.1 | 289. | EB | Scott and Waddington, 1950 | Based on data from 274. to 341. K.; AC |
Antoine Equation Parameters
log10(P) = A − (B / (T + C))
P = vapor pressure (bar)
T = temperature (K)
View plot Requires a JavaScript / HTML 5 canvas capable browser.
Temperature (K) | A | B | C | Reference | Comment |
---|---|---|---|---|---|
274.74 to 342.03 | 3.99984 | 1069.229 | -42.393 | Scott and Waddington, 1950 | Coefficents calculated by NIST from author's data. |
Enthalpy of fusion
ΔfusH (kJ/mol) | Temperature (K) | Reference | Comment |
---|---|---|---|
7.112 | 121.78 | Chao, Hall, et al., 1983 | DH |
7.1115 | 121.80 | Todd, Oliver, et al., 1947 | DH |
7.11 | 121.8 | Acree, 1991 | AC |
Entropy of fusion
ΔfusS (J/mol*K) | Temperature (K) | Reference | Comment |
---|---|---|---|
58.40 | 121.78 | Chao, Hall, et al., 1983 | DH |
58.39 | 121.80 | Todd, Oliver, et al., 1947 | DH |

Gas phase ion energetics data

Data evaluated as indicated in comments:
L - Sharon G. Lias
Data compiled as indicated in comments:
LLK - Sharon G. Lias, Rhoda D. Levin, and Sherif A. Kafafi
RDSH - Henry M. Rosenstock, Keith Draxl, Bruce W. Steiner, and John T. Herron
LBLHLM - Sharon G. Lias, John E. Bartmess, Joel F. Liebman, John L. Holmes, Rhoda D. Levin, and W. Gary Mallard
Quantity | Value | Units | Method | Reference | Comment |
---|---|---|---|---|---|
IE (evaluated) | 9.01 ± 0.03 | eV | N/A | N/A | L |
Ionization energy determinations
IE (eV) | Method | Reference | Comment |
---|---|---|---|
8.94 ± 0.02 | PE | Ashmore and Burgess, 1978 | LLK |
9.04 ± 0.02 | PE | Bieri, Burger, et al., 1977 | LLK |
9.036 ± 0.005 | PE | Masclet, Grosjean, et al., 1973 | LLK |
9.23 ± 0.02 | EI | Gross and Wilkins, 1971 | LLK |
9.11 | EI | Collin and Lossing, 1959 | RDSH |
9.22 ± 0.01 | PE | Krause, Taylor, et al., 1978 | Vertical value; LLK |
Appearance energy determinations
Ion | AE (eV) | Other Products | Method | Reference | Comment |
---|---|---|---|---|---|
C3H6+ | 11.54 ± 0.02 | C2H4 | EI | Gross and Wilkins, 1971 | LLK |
C4H7+ | 9.02 | CH3 | PI | Traeger, 1986 | LBLHLM |
C4H7+ | 10.62 | CH3 | PI | Traeger, 1986 | LBLHLM |
C4H7+ | 11.24 ± 0.02 | CH3 | EI | Gross and Wilkins, 1971 | LLK |

Reaction thermochemistry data

Data compiled by: Hussein Y. Afeefy, Joel F. Liebman, and Stephen E. Stein
Individual Reactions
By formula: C5H10 = C5H10
Quantity | Value | Units | Method | Reference | Comment |
---|---|---|---|---|---|
ΔrH° | -1.17 ± 0.02 | kcal/mol | Eqk | Kapteijn, Steen, et al., 1983 | gas phase; Between 250-823 K |
ΔrH° | -0.9 ± 0.15 | kcal/mol | Eqk | Egger and Benson, 1966 | gas phase; Heat of isomerization |
By formula: H2 + C5H10 = C5H12
Quantity | Value | Units | Method | Reference | Comment |
---|---|---|---|---|---|
ΔrH° | -28.1 ± 0.2 | kcal/mol | Chyd | Egger and Benson, 1966 | gas phase |
By formula: C5H11Cl = C5H10 + HCl
Quantity | Value | Units | Method | Reference | Comment |
---|---|---|---|---|---|
ΔrH° | 15.6 | kcal/mol | Eqk | Karaseva and Andreevskii, 1969 | gas phase |

Kovats' RI, non-polar column, isothermal

Column type | Active phase | Temperature (C) | I | Reference | Comment |
---|---|---|---|---|---|
Capillary | Methyl Silicone | 30. | 515.3 | Soják, Addová, et al., 2002 | He; Column length: 150. m; Column diameter: 0.250 mm |
Capillary | Squalane | 30. | 504.6 | Soják, Addová, et al., 2002 | He; Column length: 93. m; Column diameter: 0.250 mm |
Capillary | Squalane | 100. | 505. | Heinzen, Soares, et al., 1999 | |
Capillary | Squalane | 25. | 501. | Hilal, Carreira, et al., 1994 | |
Capillary | OV-101 | 40. | 515. | Laub and Purnell, 1988 | |
Capillary | OV-101 | 60. | 515. | Laub and Purnell, 1988 | |
Capillary | OV-101 | 80. | 514. | Laub and Purnell, 1988 | |
Capillary | Squalane | 50. | 504.8 | Papazova, Milina, et al., 1988 | Column length: 50. m; Column diameter: 0.25 mm |
Capillary | OV-101 | 50. | 512. | Boneva and Dimov, 1986 | 100. m/0.27 mm/0.9 μm, N2 |
Capillary | OV-101 | 70. | 512.4 | Boneva and Dimov, 1986 | 100. m/0.27 mm/0.9 μm, N2 |
Capillary | Squalane | 50. | 505. | Boneva and Dimov, 1986 | N2; Column length: 100. m; Column diameter: 0.25 mm |
Capillary | Squalane | 70. | 505.2 | Boneva and Dimov, 1986 | N2; Column length: 100. m; Column diameter: 0.25 mm |
Capillary | DB-1 | 40. | 515. | Lubeck and Sutton, 1984 | 60. m/0.264 mm/0.25 μm, H2 |
Capillary | HP-PONA | 40. | 515. | Lubeck and Sutton, 1984 | 50. m/0.21 mm/0.5 μm, H2 |
Capillary | OV-101 | 30. | 515. | Chien, Furio, et al., 1983 | |
Capillary | OV-101 | 40. | 515. | Chien, Furio, et al., 1983 | |
Capillary | OV-101 | 50. | 515. | Chien, Furio, et al., 1983 | |
Capillary | OV-101 | 60. | 515. | Chien, Furio, et al., 1983 | |
Capillary | OV-101 | 70. | 514. | Chien, Furio, et al., 1983 | |
Capillary | OV-101 | 80. | 514. | Chien, Furio, et al., 1983 | |
Capillary | OV-3 | 30. | 519.4 | Chien, Furio, et al., 1983, 2 | |
Capillary | OV-3 | 40. | 519.3 | Chien, Furio, et al., 1983, 2 | |
Capillary | OV-3 | 50. | 519.1 | Chien, Furio, et al., 1983, 2 | |
Capillary | OV-3 | 60. | 519.1 | Chien, Furio, et al., 1983, 2 | |
Capillary | OV-3 | 70. | 518.9 | Chien, Furio, et al., 1983, 2 | |
Capillary | OV-3 | 80. | 518.9 | Chien, Furio, et al., 1983, 2 | |
Capillary | OV-1 | 50. | 515. | Anders, Scheller, et al., 1982 | Column length: 55. m; Column diameter: 0.21 mm |
Capillary | OV-1 | 30. | 514.5 | Chien, Kopecni, et al., 1981 | H2 |
Capillary | OV-1 | 40. | 514.6 | Chien, Kopecni, et al., 1981 | H2 |
Capillary | OV-1 | 50. | 514.6 | Chien, Kopecni, et al., 1981 | H2 |
Capillary | OV-1 | 60. | 514.7 | Chien, Kopecni, et al., 1981 | H2 |
Capillary | OV-1 | 70. | 514.8 | Chien, Kopecni, et al., 1981 | H2 |
Capillary | OV-1 | 80. | 514.9 | Chien, Kopecni, et al., 1981 | H2 |
Capillary | SE-30 | 30. | 512.1 | Chien, Kopecni, et al., 1981 | H2 |
Capillary | SE-30 | 40. | 516.2 | Chien, Kopecni, et al., 1981 | H2 |
Capillary | SE-30 | 50. | 514.4 | Chien, Kopecni, et al., 1981 | H2 |
Capillary | SE-30 | 60. | 512.7 | Chien, Kopecni, et al., 1981 | H2 |
Capillary | SE-30 | 70. | 511.1 | Chien, Kopecni, et al., 1981 | H2 |
Capillary | SE-30 | 80. | 509.4 | Chien, Kopecni, et al., 1981 | H2 |
Capillary | OV-1 | 40. | 514. | Nijs and Jacobs, 1981 | He; Column length: 150. m; Column diameter: 0.50 mm |
Capillary | Squalane | 50. | 505. | Bajus, Veselý, et al., 1979 | Column length: 100. m; Column diameter: 0.25 mm |
Capillary | Squalane | 70. | 505.7 | Bajus, Veselý, et al., 1979 | Column length: 100. m; Column diameter: 0.25 mm |
Capillary | Squalane | 50. | 505.1 | Bajus, Veselý, et al., 1979, 2 | Column length: 100. m; Column diameter: 0.25 mm |
Capillary | Squalane | 70. | 505.9 | Bajus, Veselý, et al., 1979, 2 | Column length: 100. m; Column diameter: 0.25 mm |
Packed | Squalane | 80. | 504. | Chrétien and Dubois, 1977 | |
Capillary | Squalane | 50. | 505. | Chretien and Dubois, 1976 | |
Capillary | Squalane | 100. | 512.1 | Lulova, Leont'eva, et al., 1976 | He; Column length: 120. m; Column diameter: 0.25 mm |
Capillary | Squalane | 50. | 505. | Rijks and Cramers, 1974 | N2; Column length: 100. m; Column diameter: 0.25 mm |
Capillary | Squalane | 70. | 505. | Rijks and Cramers, 1974 | N2; Column length: 100. m; Column diameter: 0.25 mm |
Capillary | Squalane | 27. | 504.73 | Schomburg and Dielmann, 1973 | Column length: 100. m; Column diameter: 0.25 mm |
Capillary | Squalane | 40. | 502. | Matukuma, 1969 | N2; Column length: 91.4 m; Column diameter: 0.25 mm |
Packed | Squalane | 27. | 505. | Hively and Hinton, 1968 | He, Chromosorb P; Column length: 15. m; Column diameter: 0.25 mm |
Packed | Squalane | 49. | 505. | Hively and Hinton, 1968 | He, Chromosorb P; Column length: 15. m; Column diameter: 0.25 mm |
Packed | Squalane | 67. | 506. | Hively and Hinton, 1968 | He, Chromosorb P; Column length: 15. m; Column diameter: 0.25 mm |
Packed | Squalane | 86. | 507. | Hively and Hinton, 1968 | He, Chromosorb P; Column length: 15. m; Column diameter: 0.25 mm |
Capillary | Squalane | 70. | 507. | Schomburg, 1967 | Ar; Column length: 100. m |
Packed | Squalane | 26. | 505. | Zulaïca and Guiochon, 1966 | Column length: 10. m |

Kovats' RI, non-polar column, custom temperature program

Column type | Active phase | I | Reference | Comment |
---|---|---|---|---|
Capillary | Petrocol DH-100 | 519.6 | Haagen-Smit Laboratory, 1997 | He; Column length: 100. m; Column diameter: 0.2 mm; Program: 5C(10min) => 5C/min => 50C(48min) => 1.5C/min => 195C(91min) |
Capillary | DB-1 | 519. | Hoekman, 1993 | 60. m/0.32 mm/1.0 μm, He; Program: -40 C for 12 min; -40 - 125 C at 3 deg.min; 125-185 C at 6 deg/min; 185 - 220 C at 20 deg/min; hold 220 C for 2 min |

Van Den Dool and Kratz RI, non-polar column, temperature ramp

Column type | Active phase | I | Reference | Comment |
---|---|---|---|---|
Capillary | Methyl Silicone | 514.0 | Soják, Addová, et al., 2002 | He, 1. K/min; Column length: 150. m; Column diameter: 0.250 mm; Tstart: 30. C; Tend: 200. C |
Capillary | Ultra-1 | 516. | Olson, Sinkevitch, et al., 1992 | 4. K/min; Tstart: -40. C; Tend: 230. C |
Capillary | Petrocol DH | 510.3 | White, Douglas, et al., 1992 | 100. m/0.25 mm/0.5 μm, He, 1. K/min; Tstart: 30. C; Tend: 220. C |
Capillary | Petrocol DH | 510.35 | White, Douglas, et al., 1992 | 100. m/0.25 mm/0.5 μm, He, 1. K/min; Tstart: 30. C; Tend: 220. C |
Capillary | Petrocol DH | 510. | White, Hackett, et al., 1992 | 100. m/0.25 mm/0.5 μm, He, 1. K/min; Tstart: 30. C; Tend: 220. C |

Van Den Dool and Kratz RI, non-polar column, custom temperature program

Column type | Active phase | I | Reference | Comment |
---|---|---|---|---|
Capillary | DB-5 | 510. | Zaikin and Borisov, 2002 | He; Column length: 30. m; Column diameter: 0.25 mm; Program: 30C => 5K/min=120C => 10C/min => 270C |

Normal alkane RI, non-polar column, isothermal

Column type | Active phase | Temperature (C) | I | Reference | Comment |
---|---|---|---|---|---|
Capillary | Squalane | 40. | 505.3 | Sojak, Addova, et al., 2000 | He; Column length: 93. m; Column diameter: 0.25 mm |
Capillary | Methyl Silicone | 50. | 505. | N/A | N2; Column length: 74.6 m; Column diameter: 0.28 mm |
Packed | Methyl Silicone | 50. | 527. | Huguet, 1961 | Nitrogen, Celite C-22; Column length: 2.5 m |

Normal alkane RI, non-polar column, temperature ramp

Column type | Active phase | I | Reference | Comment |
---|---|---|---|---|
Capillary | Polydimethyl siloxane: CP-Sil 5 CB | 515. | Bramston-Cook, 2013 | 60. m/0.25 mm/1.0 μm, Helium, 45. C @ 1.45 min, 3.6 K/min, 210. C @ 2.72 min |
Capillary | Petrocol DH | 515. | Supelco, 2012 | 100. m/0.25 mm/0.50 μm, Helium, 20. C @ 15. min, 15. K/min, 220. C @ 30. min |
Capillary | PONA | 510. | Zhang, Ding, et al., 2009 | 50. m/0.20 mm/0.50 μm, Nitrogen, 35. C @ 15. min, 2. K/min, 200. C @ 10. min |
Capillary | SE-54 | 511. | Guan, Li, et al., 1995 | 60. C @ 2. min, 4. K/min; Column length: 50. m; Column diameter: 0.32 mm; Tend: 200. C |
Capillary | DB-1 | 515. | Ramnas, Ostermark, et al., 1994 | 50. m/0.32 mm/1.0 μm, He, 2. K/min; Tstart: -20. C |
Capillary | DB-1 | 511. | Ciccioli, Cecinato, et al., 1992 | 60. m/0.32 mm/1.2 μm, He, 30. C @ 10. min, 3. K/min; Tend: 240. C |

Normal alkane RI, non-polar column, custom temperature program

Column type | Active phase | I | Reference | Comment |
---|---|---|---|---|
Capillary | Polydimethyl siloxane | 505. | Junkes, Castanho, et al., 2003 | Program: not specified |
Capillary | PONA | 520. | Perkin Elmer Instruments, 2002 | Column length: 100. m; Phase thickness: 0.50 μm; Program: not specified |
Capillary | DB-1 | 515. | Zhu and Wang, 2001 | Program: not specified |
Capillary | CP-Sil5 CB MS | 511. | Tirillini, Verdelli, et al., 2000 | 50. m/0.32 mm/0.4 μm; Program: 0C (3min) => 3C/min => 50C => 5C/min => 220C (30min) |
Capillary | Methyl Silicone | 518. | Spieksma, 1999 | Program: not specified |
Capillary | OV-1 | 515. | Zhu and He, 1999 | Program: not specified |
Capillary | OV-1 | 515. | Zhu and He, 1999 | Program: not specified |
Capillary | SE-54 | 518. | Zhu and He, 1999 | Program: not specified |
Capillary | SE-54 | 519. | Zhu and He, 1999 | Program: not specified |
Capillary | Methyl Silicone | 513. | Zenkevich, 1996 | Program: not specified |
Capillary | DB-1 | 511. | Ciccioli, Cecinato, et al., 1994 | 60. m/0.32 mm/0.25 μm; Program: not specified |
Packed | SE-30 | 517. | Robinson and Odell, 1971 | N2, Chromosorb W; Column length: 6.1 m; Program: 50C910min) => 20C/min => 90(6min) => 10C/min => 150C(hold) |
Packed | Squalane | 500. | Robinson and Odell, 1971 | N2, Embacel; Column length: 3.0 m; Program: 25C(5min) => 2C/min => 35 => 4C/min => 95C(hold) |

Henry's Law data

Data compiled by: Rolf Sander
Henry's Law constant (water solution)
kH(T) = k°H exp(d(ln(kH))/d(1/T) ((1/T) - 1/(298.15 K)))
k°H = Henry's law constant for solubility in water at 298.15 K (mol/(kg*bar))
d(ln(kH))/d(1/T) = Temperature dependence constant (K)
k°H (mol/(kg*bar)) | d(ln(kH))/d(1/T) (K) | Method | Reference | Comment |
---|---|---|---|---|
0.0044 | Q | N/A | missing citation give several references for the Henry's law constants but don't assign them to specific species. | |
0.0044 | L | N/A |

References

Thermodynamics Research Center, 1997
Thermodynamics Research Center,
Selected Values of Properties of Chemical Compounds., Thermodynamics Research Center, Texas A&M University, College Station, Texas, 1997. [all data]
Kilpatrick J.E., 1946
Kilpatrick J.E.,
Heats, equilibrium constants, and free energies of formation of the monoolefin hydrocarbons,
J. Res. Nat. Bur. Stand, 1946, 36, 559-612. [all data]
Wiberg, Wasserman, et al., 1984
Wiberg, K.B.; Wasserman, D.J.; Martin, E.,
Enthalpies of hydration of alkenes. 2. The n-heptenes and n-pentenes,
J. Phys. Chem., 1984, 88, 3684-3688. [all data]
Good and Smith, 1979
Good, W.D.; Smith, N.K.,
The enthalpies of combustion of the isomeric pentenes in the liquid state. A warning to combustion calorimetrists about sample drying,
J. Chem. Thermodyn., 1979, 11, 111-118. [all data]
Coops, Mulder, et al., 1946
Coops, J.; Mulder, D.; Dienske, J.W.; Smittenberg, J.,
The heats of combustion of a number of hydrocarbons,
Rec. Trav. Chim. Pays/Bas, 1946, 65, 128. [all data]
Cox and Pilcher, 1970
Cox, J.D.; Pilcher, G.,
Thermochemistry of Organic and Organometallic Compounds, Academic Press, New York, 1970, 1-636. [all data]
Chao, Hall, et al., 1983
Chao, J.; Hall, K.R.; Yao, J.M.,
Thermodynamic properties of simple alkenes,
Thermochim. Acta, 1983, 64(3), 285-303. [all data]
Todd, Oliver, et al., 1947
Todd, S.S.; Oliver, G.D.; Huffman, H.M.,
The heat capacities, heats of fusion and entropies of the six pentenes,
J. Am. Chem. Soc., 1947, 69, 1519-1525. [all data]
Hoff, Greenlee, et al., 1951
Hoff, M.C.; Greenlee, K.W.; Boord, C.E.,
The Quantitavitve Inversion of cis- and trans-Alkene Isomers: A New Synthesis of Normal cis-Alkenes,
J. Am. Chem. Soc., 1951, 73, 3329-36. [all data]
Streiff, Murphy, et al., 1946
Streiff, A.J.; Murphy, E.T.; Sedlak, V.A.; Willingham, C.B.; Rossini, F.D.,
Purification, Purity, and Freezing Points of 7 Heptanes, 16 Octanes, 6 Pentene, Cyclopentene, and 7 C9H12 Alkylbenzenes of the API-Standard and API-NBS Series,
J. Res. Natl. Bur. Stand. (U. S.), 1946, 37, 331. [all data]
Chao, Hall, et al., 1983, 2
Chao, J.; Hall, K.R.; Yao, J.M.,
Thermodynamic Properties of Simple Alkenes,
Thermochim. Acta, 1983, 64, 285. [all data]
Todd, Oliver, et al., 1947, 2
Todd, S.S.; Oliver, G.D.; Huffman, H.M.,
The heat capacities, heats of fusion and entropies of the six pentenes.,
J. Am. Chem. Soc., 1947, 69, 1519. [all data]
Tsonopoulos and Ambrose, 1996
Tsonopoulos, C.; Ambrose, D.,
Vapor-Liquid Critical Properties of Elements and Compounds. 6. Unsaturated Aliphatic Hydrocarbons,
J. Chem. Eng. Data, 1996, 41, 645-656. [all data]
Reid, 1972
Reid, Robert C.,
Handbook on vapor pressure and heats of vaporization of hydrocarbons and related compounds, R. C. Wilhort and B. J. Zwolinski, Texas A Research Foundation. College Station, Texas(1971). 329 pages.$10.00,
AIChE J., 1972, 18, 6, 1278-1278, https://doi.org/10.1002/aic.690180637
. [all data]
Stephenson and Malanowski, 1987
Stephenson, Richard M.; Malanowski, Stanislaw,
Handbook of the Thermodynamics of Organic Compounds, 1987, https://doi.org/10.1007/978-94-009-3173-2
. [all data]
Scott and Waddington, 1950
Scott, Donald W.; Waddington, Guy,
Vapor Pressure of cis-2-Pentene, trans-2-Pentene and 3-Methyl-1-butene,
J. Am. Chem. Soc., 1950, 72, 9, 4310-4311, https://doi.org/10.1021/ja01165a542
. [all data]
Acree, 1991
Acree, William E.,
Thermodynamic properties of organic compounds: enthalpy of fusion and melting point temperature compilation,
Thermochimica Acta, 1991, 189, 1, 37-56, https://doi.org/10.1016/0040-6031(91)87098-H
. [all data]
Ashmore and Burgess, 1978
Ashmore, F.S.; Burgess, A.R.,
Photoelectron spectra of the unbranched C5-C7 alkenes, aldehydes and ketones,
J. Chem. Soc. Faraday Trans. 2, 1978, 74, 734. [all data]
Bieri, Burger, et al., 1977
Bieri, G.; Burger, F.; Heilbronner, E.; Maier, J.P.,
Valence ionization enrgies of hydrocarbons,
Helv. Chim. Acta, 1977, 60, 2213. [all data]
Masclet, Grosjean, et al., 1973
Masclet, P.; Grosjean, D.; Mouvier, G.,
Alkene ionization potentials. Part I. Quantitative determination of alkyl group structural effects,
J. Electron Spectrosc. Relat. Phenom., 1973, 2, 225. [all data]
Gross and Wilkins, 1971
Gross, M.L.; Wilkins, C.L.,
Computer-assisted ion cyclotron resonance appearance potential measurements for C5H10 isomers,
Anal. Chem., 1971, 43, 1624. [all data]
Collin and Lossing, 1959
Collin, J.; Lossing, F.P.,
Ionization potentials of some olefins, di-olefins and branched paraffins,
J. Am. Chem. Soc., 1959, 81, 2064. [all data]
Krause, Taylor, et al., 1978
Krause, D.A.; Taylor, J.W.; Fenske, R.F.,
An analysis of the effects of alkyl substituents on the ionization potentials of n-alkenes,
J. Am. Chem. Soc., 1978, 100, 718. [all data]
Traeger, 1986
Traeger, J.C.,
Heat of formation for the 1-methylallyl cation by photoionization mass spectrometry,
J. Phys. Chem., 1986, 90, 4114. [all data]