1-Propanol, 3-bromo-
- Formula: C3H7BrO
- Molecular weight: 138.991
- IUPAC Standard InChIKey: RQFUZUMFPRMVDX-UHFFFAOYSA-N
- CAS Registry Number: 627-18-9
- Chemical structure:
View 3d structure (requires JavaScript / HTML 5) - Other names: Trimethylene bromohydrin; 1-Bromo-3-propanol; 3-Bromo-1-propanol; 3-Hydroxypropyl bromide; 3-Bromopropanol-(1); 3-Bromopropanol; 1-Bromo-3-hydroxypropane; 3-bromopropan-1-ol

Phase change data

Data compiled by: Robert L. Brown and Stephen E. Stein
Reduced pressure boiling point
Tboil (K) | Pressure (bar) | Reference |
---|---|---|
335.2 | 0.007 | Weast and Grasselli, 1989 |

Gas phase ion energetics data

Data compiled by: Sharon G. Lias and Joel F. Liebman
Appearance energy determinations
Ion | AE (eV) | Other Products | Method | Reference | Comment |
---|---|---|---|---|---|
CH3O+ | 11.18 | BrCH2CH2 | EI | Holmes and Lossing, 1988 |

References

Weast and Grasselli, 1989
CRC Handbook of Data on Organic Compounds, 2nd Editon, Weast,R.C and Grasselli, J.G., ed(s)., CRC Press, Inc., Boca Raton, FL, 1989, 1. [all data]
Holmes and Lossing, 1988
Holmes, J.L.; Lossing, F.P.,
Heats of formation and bond dissociation energies in halogen-substituted methyl and ethyl radicals,
J. Am. Chem. Soc., 1988, 110, 7343. [all data]