Butane, 1-nitro-
- Formula: C4H9NO2
- Molecular weight: 103.1198
- IUPAC Standard InChIKey: NALZTFARIYUCBY-UHFFFAOYSA-N
- CAS Registry Number: 627-05-4
- Chemical structure:
View 3d structure (requires JavaScript / HTML 5) - Other names: 1-Nitrobutane; n-C4H9NO2; Nitro-butane

Condensed phase thermochemistry data

Data compiled by: Hussein Y. Afeefy, Joel F. Liebman, and Stephen E. Stein
Quantity | Value | Units | Method | Reference | Comment |
---|---|---|---|---|---|
ΔfH°liquid | -192.6 ± 1.3 | kJ/mol | Ccb | Holcomb and Dorsey, 1949 | |
Quantity | Value | Units | Method | Reference | Comment |
ΔcH°liquid | -2667.8 ± 1.3 | kJ/mol | Ccb | Holcomb and Dorsey, 1949 |

Phase change data

Data compiled as indicated in comments:
BS - Robert L. Brown and Stephen E. Stein
TRC - Thermodynamics Research Center, NIST Boulder Laboratories, Chris Muzny director
AC - William E. Acree, Jr., James S. Chickos
ALS - Hussein Y. Afeefy, Joel F. Liebman, and Stephen E. Stein
Quantity | Value | Units | Method | Reference | Comment |
---|---|---|---|---|---|
Tboil | 426.2 | K | N/A | Weast and Grasselli, 1989 | BS |
Tboil | 425.92 | K | N/A | Toops, 1956 | Uncertainty assigned by TRC = 0.06 K; TRC |
Tboil | 427.05 | K | N/A | Miller and Angel, 1946 | Uncertainty assigned by TRC = 0.5 K; TRC |
Tboil | 426.1 | K | N/A | Hodge, 1940 | Uncertainty assigned by TRC = 0.7 K; TRC |
Quantity | Value | Units | Method | Reference | Comment |
Tfus | 191.82 | K | N/A | Toops, 1956 | Uncertainty assigned by TRC = 0.05 K; TRC |
Quantity | Value | Units | Method | Reference | Comment |
ΔvapH° | 47.0 | kJ/mol | CGC | Chickos, Hosseini, et al., 1995 | Based on data from 313. to 353. K.; AC |
ΔvapH° | 48.58 ± 0.50 | kJ/mol | V | Holcomb and Dorsey, 1949 | ALS |
Enthalpy of vaporization
ΔvapH (kJ/mol) | Temperature (K) | Method | Reference | Comment |
---|---|---|---|---|
42.7 | 372. | A,EB | Stephenson and Malanowski, 1987 | Based on data from 357. to 426. K. See also Toops, 1956, 2 and Dykyj, 1971.; AC |

Gas phase ion energetics data

Data compiled as indicated in comments:
RDSH - Henry M. Rosenstock, Keith Draxl, Bruce W. Steiner, and John T. Herron
Ionization energy determinations
IE (eV) | Method | Reference | Comment |
---|---|---|---|
10.71 ± 0.01 | PE | Dewar, Shanshal, et al., 1969 | RDSH |

Kovats' RI, polar column, isothermal

Data compiled by: NIST Mass Spectrometry Data Center, William E. Wallace, director

Column type CapillaryCapillaryCapillaryCapillaryCapillary
Active phase HP-InnowaxHP-InnowaxHP-InnowaxHP-InnowaxHP-Innowax
Column length (m) 30.30.30.30.30.
Carrier gas
Substrate
Column diameter (mm)
Phase thickness (μm) 0.50.50.50.50.5
Temperature (C) 100.110.120.50.60.
I 1331.21333.71337.11310.21313.5
ReferenceGörgényi and Héberger, 2003Görgényi and Héberger, 2003Görgényi and Héberger, 2003Görgényi and Héberger, 2003Görgényi and Héberger, 2003
Comment MSDC-RI MSDC-RI MSDC-RI MSDC-RI MSDC-RI
Column type CapillaryCapillaryCapillary
Active phase HP-InnowaxHP-InnowaxHP-Innowax
Column length (m) 30.30.30.
Carrier gas
Substrate
Column diameter (mm)
Phase thickness (μm) 0.50.50.5
Temperature (C) 70.80.90.
I 1317.51322.01326.6
ReferenceGörgényi and Héberger, 2003Görgényi and Héberger, 2003Görgényi and Héberger, 2003
Comment MSDC-RI MSDC-RI MSDC-RI

Normal alkane RI, non-polar column, custom temperature program

Data compiled by: NIST Mass Spectrometry Data Center, William E. Wallace, director

Column type Capillary
Active phase Methyl Silicone
Column length (m)
Carrier gas
Substrate
Column diameter (mm)
Phase thickness (μm)
Program not specified
I 791.
ReferenceN/A
Comment MSDC-RI

References

Holcomb and Dorsey, 1949
Holcomb, D.E.; Dorsey, C.L., Jr.,
Thermodynamic properties of nitroparaffins,
Ind. Eng. Chem., 1949, 41, 2788-2792. [all data]
Weast and Grasselli, 1989
CRC Handbook of Data on Organic Compounds, 2nd Editon, Weast,R.C and Grasselli, J.G., ed(s)., CRC Press, Inc., Boca Raton, FL, 1989, 1. [all data]
Toops, 1956
Toops, E.E.,
Physical Properties of High Purity Nitroparaffins,
J. Phys. Chem., 1956, 60, 304-6. [all data]
Miller and Angel, 1946
Miller, J.G.; Angel, H.S.,
The Dipole Moment of 1-Nitrobutane.,
J. Am. Chem. Soc., 1946, 68, 2358-9. [all data]
Hodge, 1940
Hodge, E.B.,
Vapor pressures for six aliphatic nitro compounds,
Ind. Eng. Chem., 1940, 32, 748. [all data]
Chickos, Hosseini, et al., 1995
Chickos, James S.; Hosseini, Sarah; Hesse, Donald G.,
Determination of vaporization enthalpies of simple organic molecules by correlations of changes in gas chromatographic net retention times,
Thermochimica Acta, 1995, 249, 41-62, https://doi.org/10.1016/0040-6031(95)90670-3
. [all data]
Stephenson and Malanowski, 1987
Stephenson, Richard M.; Malanowski, Stanislaw,
Handbook of the Thermodynamics of Organic Compounds, 1987, https://doi.org/10.1007/978-94-009-3173-2
. [all data]
Toops, 1956, 2
Toops, Emory E.,
Physical Properties of Eight High-Purity Nitroparaffins,
J. Phys. Chem., 1956, 60, 3, 304-306, https://doi.org/10.1021/j150537a012
. [all data]
Dykyj, 1971
Dykyj, J.,
Petrochemia, 1971, 11, 2, 27. [all data]
Dewar, Shanshal, et al., 1969
Dewar, M.J.S.; Shanshal, M.; Worley, S.D.,
Calculated and observed ionization potentials gf nitroalkanes and of nitrous and nitric acids and esters. Extension of the MINDO method to nitrogen-oxygen compounds,
J. Am. Chem. Soc., 1969, 91, 3590. [all data]