Propane, 1-ethoxy-2-methyl-
- Formula: C6H14O
- Molecular weight: 102.1748
- IUPAC Standard InChIKey: RQUBQBFVDOLUKC-UHFFFAOYSA-N
- CAS Registry Number: 627-02-1
- Chemical structure:
View 3d structure (requires JavaScript / HTML 5) - Other names: Ether, ethyl isobutyl; Ethyl isobutyl ether; Isobutyl ethyl ether; (CH3)2CHCH2OC2H5; 1-Ethoxy-2-methylpropane

Phase change data

Data compiled as indicated in comments:
BS - Robert L. Brown and Stephen E. Stein
TRC - Thermodynamics Research Center, NIST Boulder Laboratories, Chris Muzny director
Quantity | Value | Units | Method | Reference | Comment |
---|---|---|---|---|---|
Tboil | 354.2 | K | N/A | Weast and Grasselli, 1989 | BS |
Tboil | 346. to 347. | K | N/A | Frinton Laboratories Inc., 1986 | BS |
Tboil | 354.3 | K | N/A | Majer and Svoboda, 1985 | |
Tboil | 354.3 | K | N/A | Norris and Rigby, 1932 | Uncertainty assigned by TRC = 0.5 K; TRC |
Quantity | Value | Units | Method | Reference | Comment |
ΔvapH° | 34.14 | kJ/mol | N/A | Majer and Svoboda, 1985 |
Enthalpy of vaporization
ΔvapH (kJ/mol) | Temperature (K) | Reference | Comment |
---|---|---|---|
30.33 | 354.3 | Majer and Svoboda, 1985 |

Gas phase ion energetics data

Data compiled as indicated in comments:
LBLHLM - Sharon G. Lias, John E. Bartmess, Joel F. Liebman, John L. Holmes, Rhoda D. Levin, and W. Gary Mallard
RDSH - Henry M. Rosenstock, Keith Draxl, Bruce W. Steiner, and John T. Herron
Ionization energy determinations
IE (eV) | Method | Reference | Comment |
---|---|---|---|
9.3 ± 0.1 | EI | Audier, Bouchoux, et al., 1982 | LBLHLM |
Appearance energy determinations
Ion | AE (eV) | Other Products | Method | Reference | Comment |
---|---|---|---|---|---|
C3H7O+ | 10.3 ± 0.1 | ? | EI | Tsang and Harrison, 1970 | RDSH |
C4H8+ | 9.9 ± 0.1 | C2H6OH | EI | Audier, Bouchoux, et al., 1982 | LBLHLM |
C4H9O+ | 9.5 ± 0.1 | C2H5 | EI | Audier, Bouchoux, et al., 1982 | LBLHLM |

Kovats' RI, non-polar column, isothermal

Column type | Active phase | Temperature (C) | I | Reference | Comment |
---|---|---|---|---|---|
Packed | Squalane | 80. | 628. | Fernández-Sánchez, García-Domínguez, et al., 1987 | H2 |
Packed | Silicon High Vacuum Grease (obsolete) | 170. | 640. | Jonas, Janák, et al., 1966 | H2 |

Normal alkane RI, non-polar column, temperature ramp

Column type | Active phase | I | Reference | Comment |
---|---|---|---|---|
Capillary | DB-5 | 646. | Savel'eva, Zenkevich, et al., 2003 | 25. m/0.20 mm/0.33 μm, Helium, 40. C @ 1. min, 5. K/min, 270. C @ 15. min |

Normal alkane RI, non-polar column, custom temperature program

Column type | Active phase | I | Reference | Comment |
---|---|---|---|---|
Capillary | Polydimethyl siloxanes | 646. | Zenkevich, Chupalov, et al., 1996 | Program: not specified |

Normal alkane RI, polar column, temperature ramp

Column type | Active phase | I | Reference | Comment |
---|---|---|---|---|
Capillary | DB-Wax | 1364. | Moon and Shibamoto, 2009 | 60. m/0.25 mm/0.50 μm, Helium, 40. C @ 5. min, 2. K/min, 210. C @ 70. min |

References

Weast and Grasselli, 1989
CRC Handbook of Data on Organic Compounds, 2nd Editon, Weast,R.C and Grasselli, J.G., ed(s)., CRC Press, Inc., Boca Raton, FL, 1989, 1. [all data]
Frinton Laboratories Inc., 1986
Frinton Laboratories Inc.,
Catalog Number 11, Frinton Laboratories Inc., Vineland, NJ, 1986, 99. [all data]
Majer and Svoboda, 1985
Majer, V.; Svoboda, V.,
Enthalpies of Vaporization of Organic Compounds: A Critical Review and Data Compilation, Blackwell Scientific Publications, Oxford, 1985, 300. [all data]
Norris and Rigby, 1932
Norris, J.F.; Rigby, G.W.,
Reactivity of Atoms and Groups in Organic Compounds XII. The Preparation and Properties of Mixed Aliphatic Ethers with Special Reference to those Containing the Tert-Butyl Radical,
J. Am. Chem. Soc., 1932, 54, 2088. [all data]
Audier, Bouchoux, et al., 1982
Audier, H.E.; Bouchoux, G.; Hoppilliard, Y.; Milliet, A.,
The mechanism of formation of [C4H9O]+ ions from isobutyl etyhyl ether,
Org. Mass Spectrom., 1982, 17, 382. [all data]
Tsang and Harrison, 1970
Tsang, C.W.; Harrison, A.G.,
Four-centred rearrangements in the mass spectra of aliphatic ethers,
Org. Mass Spectrom., 1970, 3, 647. [all data]
Fernández-Sánchez, García-Domínguez, et al., 1987
Fernández-Sánchez, E.; García-Domínguez, J.A.; García-Muñoz, J.; Menéndez, V.; Molera, M.J.,
Prediction of gas chromatographic retention indices on binary mixed stationary phases,
An. Quim., 1987, 83, 56-58. [all data]
Jonas, Janák, et al., 1966
Jonas, J.; Janák, J.; Kratochvíl, M.,
Structural investigations with the aid of Kovats retention index system on one (nonpolar) stationary phase,
J. Gas Chromatogr., 1966, 4, 9, 332-335, https://doi.org/10.1093/chromsci/4.9.332
. [all data]
Savel'eva, Zenkevich, et al., 2003
Savel'eva, E.I.; Zenkevich, I.G.; Radilov, A.S.,
Identification the Products of Chemical Neutralization of O-Isobutyl-S-(2-diethylaminoethyl)methylthiophosphonate in the Composition of Bitumen-Salt Matrices,
Zh. Anal. Khim. (Rus.), 2003, 58, 2, 135-145. [all data]
Zenkevich, Chupalov, et al., 1996
Zenkevich, I.G.; Chupalov, A.A.; Herzschuh, R.,
Correlation of the Increments of Gas Chromatographic Retention Indices with the Differences of Innermolecular Energies of Reagents and Products of Chemical Reactions,
Zh. Org. Khim. (Rus.), 1996, 32, 11, 1685-1691. [all data]
Moon and Shibamoto, 2009
Moon, J.-K.; Shibamoto, T.,
Role of roasting conditions in the profile of volatile flavor chemicals formed from coffee beans,
J. Agric. Food Chem., 2009, 57, 13, 5823-5831, https://doi.org/10.1021/jf901136e
. [all data]