1,4-Pentanediol
- Formula: C5H12O2
- Molecular weight: 104.1476
- IUPAC Standard InChIKey: GLOBUAZSRIOKLN-UHFFFAOYSA-N
- CAS Registry Number: 626-95-9
- Chemical structure:
View 3d structure (requires JavaScript / HTML 5) - Other names: pentane-1,4-diol

Gas phase ion energetics data

Data compiled by: Sharon G. Lias and Joel F. Liebman
Appearance energy determinations
Ion | AE (eV) | Other Products | Method | Reference | Comment |
---|---|---|---|---|---|
C3H7O+ | 10.16 | C2H5O | EI | Holmes, Lossing, et al., 1991 |

References

Holmes, Lossing, et al., 1991
Holmes, J.L.; Lossing, F.P.; Mayer, P.M.,
Heats of formation of oxygen-containing organic free radicals from appearance energy measurements,
J. Am. Chem. Soc., 1991, 113, 9723. [all data]