Butane, 1-methoxy-3-methyl-
- Formula: C6H14O
- Molecular weight: 102.1748
- IUPAC Standard InChIKey: ZQAYBCWERYRAMF-UHFFFAOYSA-N
- CAS Registry Number: 626-91-5
- Chemical structure:
View 3d structure (requires JavaScript / HTML 5) - Other names: Ether, isopentyl methyl; Isopentyl methyl ether; (CH3)2CHCH2CH2OCH3; 4-Methoxy-2-methylbutane; 1-Methoxy-isopentane; Methyl isopentyl ether

Phase change data

Quantity | Value | Units | Method | Reference | Comment |
---|---|---|---|---|---|
Tboil | 364.6 | K | N/A | Majer and Svoboda, 1985 | |
Quantity | Value | Units | Method | Reference | Comment |
ΔvapH° | 35.75 | kJ/mol | N/A | Majer and Svoboda, 1985 |
Enthalpy of vaporization
ΔvapH (kJ/mol) | Temperature (K) | Reference | Comment |
---|---|---|---|
31.29 | 364.6 | Majer and Svoboda, 1985 |

Gas phase ion energetics data

Data compiled by: Sharon G. Lias, Rhoda D. Levin, and Sherif A. Kafafi
Ionization energy determinations
IE (eV) | Method | Reference | Comment |
---|---|---|---|
≤9.65 | PE | Bachiri, Mouvier, et al., 1980 | Vertical value |

Van Den Dool and Kratz RI, non-polar column, custom temperature program

Column type | Active phase | I | Reference | Comment |
---|---|---|---|---|
Capillary | VF-5MS | 693.8 | Tret'yakov, 2007 | 30. m/0.25 mm/0.25 μm, He; Program: Multi-step temperature program; T(initial)=60C; T(final)=270C |

Normal alkane RI, non-polar column, temperature ramp

Column type | Active phase | I | Reference | Comment |
---|---|---|---|---|
Capillary | HP-5 | 684. | Larsen and Frisvad, 1995 | 35. C @ 2. min, 6. K/min; Tend: 200. C |

References

Majer and Svoboda, 1985
Majer, V.; Svoboda, V.,
Enthalpies of Vaporization of Organic Compounds: A Critical Review and Data Compilation, Blackwell Scientific Publications, Oxford, 1985, 300. [all data]
Bachiri, Mouvier, et al., 1980
Bachiri, M.; Mouvier, G.; Carlier, P.; Dubois, J.E.,
Evaluation quantitative des effets de substituants sur les premiers potentiels d'ionisation de composes monofonctionnels aliphatiques,
J. Chim. Phys., 1980, 77, 899. [all data]
Tret'yakov, 2007
Tret'yakov, K.V.,
Retention Data. NIST Mass Spectrometry Data Center., NIST Mass Spectrometry Data Center, 2007. [all data]
Larsen and Frisvad, 1995
Larsen, T.O.; Frisvad, J.C.,
Characterization of volatile metabolites from 47 Penicillium taxa,
Mycol. Res., 1995, 99, 10, 1153-1166, https://doi.org/10.1016/S0953-7562(09)80271-2
. [all data]