Pyridine, 3-bromo-
- Formula: C5H4BrN
- Molecular weight: 157.996
- IUPAC Standard InChIKey: NYPYPOZNGOXYSU-UHFFFAOYSA-N
- CAS Registry Number: 626-55-1
- Chemical structure:
View 3d structure (requires JavaScript / HTML 5) - Other names: 3-Bromopyridine

Phase change data

Data compiled as indicated in comments:
BS - Robert L. Brown and Stephen E. Stein
AC - William E. Acree, Jr., James S. Chickos
Quantity | Value | Units | Method | Reference | Comment |
---|---|---|---|---|---|
Tboil | 446.2 | K | N/A | Aldrich Chemical Company Inc., 1990 | BS |
Quantity | Value | Units | Method | Reference | Comment |
ΔvapH° | 52.1 ± 1.3 | kJ/mol | C | Ribeiro da Silva, 1997 | AC |
Reduced pressure boiling point
Tboil (K) | Pressure (bar) | Reference | Comment |
---|---|---|---|
342.2 | 0.024 | Weast and Grasselli, 1989 | BS |
Enthalpy of vaporization
ΔvapH (kJ/mol) | Temperature (K) | Method | Reference | Comment |
---|---|---|---|---|
47.4 | 304. | A | Stephenson and Malanowski, 1987 | Based on data from 289. to 447. K. See also Stull, 1947.; AC |
Antoine Equation Parameters
log10(P) = A − (B / (T + C))
P = vapor pressure (bar)
T = temperature (K)
View plot Requires a JavaScript / HTML 5 canvas capable browser.
Temperature (K) | A | B | C | Reference | Comment |
---|---|---|---|---|---|
289.9 to 446.6 | 4.44291 | 1767.261 | -48.40 | Stull, 1947 | Coefficents calculated by NIST from author's data. |

Gas phase ion energetics data

Data evaluated as indicated in comments:
HL - Edward P. Hunter and Sharon G. Lias
Data compiled as indicated in comments:
LLK - Sharon G. Lias, Rhoda D. Levin, and Sherif A. Kafafi
Quantity | Value | Units | Method | Reference | Comment |
---|---|---|---|---|---|
Proton affinity (review) | 910.0 | kJ/mol | N/A | Hunter and Lias, 1998 | HL |
Quantity | Value | Units | Method | Reference | Comment |
Gas basicity | 878.2 | kJ/mol | N/A | Hunter and Lias, 1998 | HL |
Ionization energy determinations
IE (eV) | Method | Reference | Comment |
---|---|---|---|
9.8 ± 0.1 | EI | Stefanovic and Grutzmacher, 1974 | LLK |

References

Aldrich Chemical Company Inc., 1990
Aldrich Chemical Company Inc.,
Catalog Handbook of Fine Chemicals, Aldrich Chemical Company, Inc., Milwaukee WI, 1990, 1. [all data]
Ribeiro da Silva, 1997
Ribeiro da Silva, M.,
Standard molar enthalpies of formation of 2- and 3-bromopyridine and of 2,5- and 2,6-dibromopyridine,
The Journal of Chemical Thermodynamics, 1997, 29, 12, 1545-1551, https://doi.org/10.1006/jcht.1997.0268
. [all data]
Weast and Grasselli, 1989
CRC Handbook of Data on Organic Compounds, 2nd Editon, Weast,R.C and Grasselli, J.G., ed(s)., CRC Press, Inc., Boca Raton, FL, 1989, 1. [all data]
Stephenson and Malanowski, 1987
Stephenson, Richard M.; Malanowski, Stanislaw,
Handbook of the Thermodynamics of Organic Compounds, 1987, https://doi.org/10.1007/978-94-009-3173-2
. [all data]
Stull, 1947
Stull, Daniel R.,
Vapor Pressure of Pure Substances. Organic and Inorganic Compounds,
Ind. Eng. Chem., 1947, 39, 4, 517-540, https://doi.org/10.1021/ie50448a022
. [all data]
Hunter and Lias, 1998
Hunter, E.P.; Lias, S.G.,
Evaluated Gas Phase Basicities and Proton Affinities of Molecules: An Update,
J. Phys. Chem. Ref. Data, 1998, 27, 3, 413-656, https://doi.org/10.1063/1.556018
. [all data]
Stefanovic and Grutzmacher, 1974
Stefanovic, D.; Grutzmacher, H.F.,
The ionisation potential of some substituted pyridines,
Org. Mass Spectrom., 1974, 9, 1052. [all data]
Brown and McDaniel, 1955
Brown, H.C.; McDaniel, D.H.,
J. Am. Chem. Soc., 1955, 77, 3752. [all data]