2,4,6-Cycloheptatrien-1-one, 2-amino-
- Formula: C7H7NO
- Molecular weight: 121.1366
- IUPAC Standard InChIKey: PIOPKWFBKZTUMS-UHFFFAOYSA-N
- CAS Registry Number: 6264-93-3
- Chemical structure:
View 3d structure (requires JavaScript / HTML 5) - Other names: 2-Aminotropone; 2-Amino-2,4,6-cycloheptatriene-1-one; 2-Amino-2,4,6-cycloheptatrien-1-one

Phase change data

Data compiled by: William E. Acree, Jr., James S. Chickos
Enthalpy of sublimation
ΔsubH (kJ/mol) | Temperature (K) | Method | Reference |
---|---|---|---|
71.1 ± 0.4 | 273. to 333. | ME | Jackson, Hung, et al., 1971 |

Gas phase ion energetics data

Data compiled as indicated in comments:
RDSH - Henry M. Rosenstock, Keith Draxl, Bruce W. Steiner, and John T. Herron
Ionization energy determinations
IE (eV) | Method | Reference | Comment |
---|---|---|---|
9.43 ± 0.02 | EI | Higasi, Nozoe, et al., 1957 | RDSH |

References

Jackson, Hung, et al., 1971
Jackson, W.; Hung, T.S.; Hopkins, H.P., Jr.,
Delocalization energies of troponoids from bomb calorimetric and vapour pressure measurements,
J. Chem. Thermodyn., 1971, 3, 347-353. [all data]
Higasi, Nozoe, et al., 1957
Higasi, K.; Nozoe, T.; Omura, I.,
Ionization potentials of some organic molecules. IV. Troponoid compounds,
Bull. Chem. Soc. Japan, 1957, 30, 408. [all data]
Doering and Hiskey, 1952
Doering, von E.; Hiskey, C.F.,
J. Am. Chem. Soc., 1952, 74, 5688. [all data]