Urea,N-(2-chlorophenyl)-N'-(1-methylethyl)-
- Formula: C10H13ClN2O
- Molecular weight: 212.676
- IUPAC Standard InChIKey: SVBJJVCHSIPCIM-UHFFFAOYSA-N
- CAS Registry Number: 62635-47-6
- Chemical structure:
View 3d structure (requires JavaScript / HTML 5) - Permanent link for this species. Use this link for bookmarking this species for future reference.

Gas phase ion energetics data

Data compiled by: Sharon G. Lias, Rhoda D. Levin, and Sherif A. Kafafi
Ionization energy determinations
IE (eV) | Method | Reference |
---|---|---|
8.15 ± 0.05 | EI | Baldwin, Loudon, et al., 1976 |
Appearance energy determinations
Ion | AE (eV) | Other Products | Method | Reference | Comment |
---|---|---|---|---|---|
C6H6NCl+ | 9.80 | ? | EI | Baldwin, Loudon, et al., 1976 | |
C10H13N2O+ | 9.20 | Cl | EI | Baldwin, Loudon, et al., 1976 |

References

Baldwin, Loudon, et al., 1976
Baldwin, M.A.; Loudon, A.G.; Maccoll, A.; Webb, K.S.,
The nature and fragmentation pathways of the molecular ions of some arylureas, arylthioureas, acetanilides, thioacetanilides and related compounds,
Org. Mass Spectrom., 1976, 11, 1181. [all data]