Benzene, 1-chloro-3-fluoro-
- Formula: C6H4ClF
- Molecular weight: 130.547
- IUPAC Standard InChIKey: VZHJIJZEOCBKRA-UHFFFAOYSA-N
- CAS Registry Number: 625-98-9
- Chemical structure:
View 3d structure (requires JavaScript / HTML 5) - Other names: m-Chlorofluorobenzene; m-Fluorochlorobenzene; 1-Chloro-3-fluorobenzene; 1-Fluoro-3-chlorobenzene; 3-Chlorofluorobenzene

Phase change data

Data compiled as indicated in comments:
BS - Robert L. Brown and Stephen E. Stein
AC - William E. Acree, Jr., James S. Chickos
Quantity | Value | Units | Method | Reference | Comment |
---|---|---|---|---|---|
Tboil | 399. to 401. | K | N/A | PCR Inc., 1990 | BS |
Tboil | 400.8 | K | N/A | Weast and Grasselli, 1989 | BS |
Enthalpy of vaporization
ΔvapH (kJ/mol) | Temperature (K) | Method | Reference | Comment |
---|---|---|---|---|
37.4 | 288. | A | Stephenson and Malanowski, 1987 | Based on data from 273. to 403. K.; AC |

Gas phase ion energetics data

Data compiled as indicated in comments:
LLK - Sharon G. Lias, Rhoda D. Levin, and Sherif A. Kafafi
RDSH - Henry M. Rosenstock, Keith Draxl, Bruce W. Steiner, and John T. Herron
Ionization energy determinations
IE (eV) | Method | Reference | Comment |
---|---|---|---|
9.22 ± 0.02 | PE | Mohraz, Maier, et al., 1980 | LLK |
9.21 ± 0.01 | PI | Watanabe, Nakayama, et al., 1962 | RDSH |
9.25 | PE | Gounelle, Jullien, et al., 1975 | Vertical value; LLK |
Appearance energy determinations
Ion | AE (eV) | Other Products | Method | Reference | Comment |
---|---|---|---|---|---|
C6H3+ | 16.78 | ? | El | Momigny and Wirtz-Cordier, 1962 | RDSH |
C6H4F+ | 13.4 ± 0.1 | Cl | EI | Brown, 1970 | RDSH |

Kovats' RI, non-polar column, custom temperature program

View large format table.

Column type Active phase I Reference Comment
PackedApiezon M835.4Jalali-Heravi and Garkani-Nejad, 1993Chromosorb W; Column length: 2. m; Program: not specified

Van Den Dool and Kratz RI, non-polar column, temperature ramp

View large format table.

Column type Active phase I Reference Comment
CapillaryOV-1811.1Gautzsch and Zinn, 19968. K/min; Tstart: 35. C; Tend: 300. C
CapillaryOV-1811.1Gautzsch and Zinn, 19968. K/min; Tstart: 35. C; Tend: 300. C

Normal alkane RI, non-polar column, custom temperature program

View large format table.

Column type Active phase I Reference Comment
CapillaryPolydimethyl siloxanes812.Zenkevich, Eliseenkov, et al., 2006Program: not specified

References

PCR Inc., 1990
PCR Inc.,
Research Chemicals Catalog 1990-1991, PCR Inc., Gainesville, FL, 1990, 1. [all data]
Weast and Grasselli, 1989
CRC Handbook of Data on Organic Compounds, 2nd Editon, Weast,R.C and Grasselli, J.G., ed(s)., CRC Press, Inc., Boca Raton, FL, 1989, 1. [all data]
Stephenson and Malanowski, 1987
Stephenson, Richard M.; Malanowski, Stanislaw,
Handbook of the Thermodynamics of Organic Compounds, 1987, https://doi.org/10.1007/978-94-009-3173-2
. [all data]
Mohraz, Maier, et al., 1980
Mohraz, M.; Maier, J.P.; Heilbronner, E.,
He(I α) and He(Iα) photoelectron spectra of fluorinated chloro- and bromobenzenes,
J. Electron Spectrosc. Relat. Phenom., 1980, 19, 429. [all data]
Watanabe, Nakayama, et al., 1962
Watanabe, K.; Nakayama, T.; Mottl, J.,
Ionization potentials of some molecules,
J. Quant. Spectry. Radiative Transfer, 1962, 2, 369. [all data]
Gounelle, Jullien, et al., 1975
Gounelle, Y.; Jullien, J.; Solgadi, D.; Botter, R.; Menes, F.,
No. 157. - Effets de l'isomerie sur les potentiels d'ionisation: Spectres des photoelectrons de dihalogeno-benzenes,
J. Chim. Phys., 1975, 10, 1094. [all data]
Momigny and Wirtz-Cordier, 1962
Momigny, J.; Wirtz-Cordier, A.M.,
Les effets de l'impact electronique sur des derives dihalogenes du benzene,
Ann. Soc. Sci. Bruxelles, 1962, 76, 164. [all data]
Brown, 1970
Brown, P.,
Kinetic studies in mass spectrometry-IV. The [M - Cl] reaction in substituted chlorobenzenes and the question of molecular ion isomerization,
Org. Mass Spectrom., 1970, 3, 639. [all data]