Benzene, 1-iodo-3-methyl-
- Formula: C7H7I
- Molecular weight: 218.0350
- IUPAC Standard InChIKey: VLCPISYURGTGLP-UHFFFAOYSA-N
- CAS Registry Number: 625-95-6
- Chemical structure:

Gas phase thermochemistry data

Data compiled by: Hussein Y. Afeefy, Joel F. Liebman, and Stephen E. Stein
Quantity | Value | Units | Method | Reference | Comment |
---|---|---|---|---|---|
ΔfH°gas | 31.9 ± 1.4 | kcal/mol | Ccb | Smith, 1956 | Heat of formation derived by Cox and Pilcher, 1970 |

Condensed phase thermochemistry data

Data compiled by: Hussein Y. Afeefy, Joel F. Liebman, and Stephen E. Stein
Quantity | Value | Units | Method | Reference | Comment |
---|---|---|---|---|---|
ΔfH°liquid | 18.9 ± 1.0 | kcal/mol | Ccb | Smith, 1956 | Heat of formation derived by Cox and Pilcher, 1970 |
Quantity | Value | Units | Method | Reference | Comment |
ΔcH°liquid | -916.4 ± 1.0 | kcal/mol | Ccb | Smith, 1956 | Reanalyzed by Cox and Pilcher, 1970, Original value = -915.49 kcal/mol |

Phase change data

Data compiled as indicated in comments:
BS - Robert L. Brown and Stephen E. Stein
ALS - Hussein Y. Afeefy, Joel F. Liebman, and Stephen E. Stein
Quantity | Value | Units | Method | Reference | Comment |
---|---|---|---|---|---|
Tboil | 486.2 | K | N/A | Weast and Grasselli, 1989 | BS |
Quantity | Value | Units | Method | Reference | Comment |
ΔvapH° | 13.0 ± 1.0 | kcal/mol | V | Smith, 1956 | Heat of formation derived by Cox and Pilcher, 1970; ALS |
Reduced pressure boiling point
Tboil (K) | Pressure (atm) | Reference | Comment |
---|---|---|---|
354.2 | 0.013 | Weast and Grasselli, 1989 | BS |

Gas phase ion energetics data

Data compiled as indicated in comments:
B - John E. Bartmess
LLK - Sharon G. Lias, Rhoda D. Levin, and Sherif A. Kafafi
RDSH - Henry M. Rosenstock, Keith Draxl, Bruce W. Steiner, and John T. Herron
LL - Sharon G. Lias and Joel F. Liebman
Ionization energy determinations
IE (eV) | Method | Reference | Comment |
---|---|---|---|
8.6 ± 0.1 | EI | Tajima and Tsuchiya, 1972 | LLK |
8.61 ± 0.03 | PI | Watanabe, Nakayama, et al., 1962 | RDSH |
Appearance energy determinations
Ion | AE (eV) | Other Products | Method | Reference | Comment |
---|---|---|---|---|---|
C5H5+ | 14.5 ± 0.2 | C2H2+I | EI | Tajima and Tsuchiya, 1973 | LLK |
C5H5+ | 14.47 ± 0.15 | ? | EI | Tajima and Tsuchiya, 1972 | LLK |
C7H7+ | 10.3 ± 0.20 | I | PI | Dunbar, Honovich, et al., 1988 | LL |
C7H7+ | 11.0 ± 0.3 | ? | EI | McLafferty and Winkler, 1974 | LLK |
C7H7+ | 11.3 ± 0.1 | ? | EI | Tajima and Tsuchiya, 1972 | LLK |
C7H7+ | 11.3 | I | EI | Yeo and Williams, 1970 | RDSH |
De-protonation reactions
C7H6I- + =
By formula: C7H6I- + H+ = C7H7I
Quantity | Value | Units | Method | Reference | Comment |
---|---|---|---|---|---|
ΔrH° | 372.1 ± 3.1 | kcal/mol | G+TS | Wenthold, Wierschke, et al., 1994 | gas phase; Between MeCN and FCH2CH2OH; B |
Quantity | Value | Units | Method | Reference | Comment |
ΔrG° | 365.0 ± 3.0 | kcal/mol | IMRB | Wenthold, Wierschke, et al., 1994 | gas phase; Between MeCN and FCH2CH2OH; B |

Reaction thermochemistry data

Data compiled by: John E. Bartmess

Individual Reactions

C7H6I- + Hydrogen cation = Benzene, 1-iodo-3-methyl-

By formula: C7H6I- + H+ = C7H7I

Quantity Value Units Method Reference Comment
Δr1557. ± 13.kJ/molG+TSWenthold, Wierschke, et al., 1994gas phase; Between MeCN and FCH2CH2OH
Quantity Value Units Method Reference Comment
Δr1527. ± 13.kJ/molIMRBWenthold, Wierschke, et al., 1994gas phase; Between MeCN and FCH2CH2OH

Van Den Dool and Kratz RI, non-polar column, temperature ramp

View large format table.

Column type Active phase I Reference Comment
CapillaryOV-11121.8Gautzsch and Zinn, 19968. K/min; Tstart: 35. C; Tend: 300. C
PackedSE-301148.Buchman, Cao, et al., 1984He, Chromosorb AW, 40. C @ 10. min, 10. K/min, 210. C @ 30. min; Column length: 3.05 m

Van Den Dool and Kratz RI, polar column, temperature ramp

View large format table.

Column type Active phase I Reference Comment
PackedCarbowax 20M1674.Buchman, Cao, et al., 1984He, Supelcoport, 40. C @ 10. min, 10. K/min, 210. C @ 30. min; Column length: 3.05 m

Normal alkane RI, non-polar column, temperature ramp

View large format table.

Column type Active phase I Reference Comment
PackedSE-301143.Peng, Ding, et al., 1988Helium, Supelcoport, 40. C @ 4. min, 10. K/min, 200. C @ 60. min; Column length: 3.05 m
PackedSE-301148.Peng, Ding, et al., 1988Helium, Supelcoport, 40. C @ 4. min, 10. K/min, 200. C @ 60. min; Column length: 3.05 m

Normal alkane RI, non-polar column, custom temperature program

View large format table.

Column type Active phase I Reference Comment
CapillaryOV-1, SE-30, Methyl silicone, SP-2100, OV-101, DB-1, etc.1148.Waggott and Davies, 1984Hydrogen; Column length: 50. m; Column diameter: 0.32 mm; Program: not specified

References

Smith, 1956
Smith, L.,
Corrected heats of combustion of organic iodine compounds,
Acta Chem. Scand., 1956, 10, 884-886. [all data]
Cox and Pilcher, 1970
Cox, J.D.; Pilcher, G.,
Thermochemistry of Organic and Organometallic Compounds, Academic Press, New York, 1970, 1-636. [all data]
Weast and Grasselli, 1989
CRC Handbook of Data on Organic Compounds, 2nd Editon, Weast,R.C and Grasselli, J.G., ed(s)., CRC Press, Inc., Boca Raton, FL, 1989, 1. [all data]
Tajima and Tsuchiya, 1972
Tajima, S.; Tsuchiya, T.,
The effects of the repeller voltage and the shield voltage on appearance potential measurements by electron impact,
Shitsuryo Bunseki, 1972, 20, 117. [all data]
Watanabe, Nakayama, et al., 1962
Watanabe, K.; Nakayama, T.; Mottl, J.,
Ionization potentials of some molecules,
J. Quant. Spectry. Radiative Transfer, 1962, 2, 369. [all data]
Tajima and Tsuchiya, 1973
Tajima, S.; Tsuchiya, T.,
Energetics consideration of C5H5+ ions produced from various precursors by electron impact,
Bull. Chem. Soc. Jpn., 1973, 46, 3291. [all data]
Dunbar, Honovich, et al., 1988
Dunbar, R.C.; Honovich, J.P.; Asamoto, B.,
Photodissociation thermochemistry as a probe of halotoluene ion potential surfaces,
J. Phys. Chem., 1988, 92, 6935. [all data]
McLafferty and Winkler, 1974
McLafferty, F.W.; Winkler, J.,
Gaseous tropylium, benzyl, tolyl, and norbornadienyl cations,
J. Am. Chem. Soc., 1974, 96, 5182. [all data]
Yeo and Williams, 1970
Yeo, A.N.H.; Williams, D.H.,
Rearrangement in the molecular ions of halogenotoluenes prior to fragmentation in the mass spectrometer,
Chem. Commun., 1970, 886. [all data]
Wenthold, Wierschke, et al., 1994
Wenthold, P.G.; Wierschke, S.G.; Nash, J.J.; Squires, R.R.,
Biradical thermochemistry from collision-induced dissociation threshold energy measurements .2. Experimental and theoretical studies of the Mechanism and Thermochemistry of Formation of alph,
J. Am. Chem. Soc., 1994, 116, 16, 7378, https://doi.org/10.1021/ja00095a048
. [all data]