Thiophene, 2,5-diiodo-

Phase change data

Data compiled by: Robert L. Brown and Stephen E. Stein

Quantity Value Units Method Reference Comment
Tboil412.7KN/AAldrich Chemical Company Inc., 1990

Reduced pressure boiling point

Tboil (K) Pressure (atm) Reference
412.70.020Weast and Grasselli, 1989

Gas phase ion energetics data

Data compiled as indicated in comments:
LLK - Sharon G. Lias, Rhoda D. Levin, and Sherif A. Kafafi

Ionization energy determinations

IE (eV) Method Reference Comment
8.35CTSAloisi and Pignataro, 1973LLK
8.32EIAloisi and Pignataro, 1973LLK
8.28PEBozic, Humski, et al., 1977Vertical value; LLK

References

Aldrich Chemical Company Inc., 1990
Aldrich Chemical Company Inc., Catalog Handbook of Fine Chemicals, Aldrich Chemical Company, Inc., Milwaukee WI, 1990, 1. [all data]

Weast and Grasselli, 1989
CRC Handbook of Data on Organic Compounds, 2nd Editon, Weast,R.C and Grasselli, J.G., ed(s)., CRC Press, Inc., Boca Raton, FL, 1989, 1. [all data]

Aloisi and Pignataro, 1973
Aloisi, G.G.; Pignataro, S., Molecular complexes of substituted thiophens with σ and π acceptors, J. Chem. Soc. Faraday Trans. 1, 1973, 69, 534. [all data]

Bozic, Humski, et al., 1977
Bozic, Z.; Humski, K.; Cvitas, T.; Klasinc, L., Photoelectron spectra of bromo- and iodo- thiophens, J. Chem. Soc. Perkin Trans. 2, 1977, 1413. [all data]