Furan, 2,5-dimethyl-
- Formula: C6H8O
- Molecular weight: 96.1271
- IUPAC Standard InChIKey: GSNUFIFRDBKVIE-UHFFFAOYSA-N
- CAS Registry Number: 625-86-5
- Chemical structure:
View 3d structure (requires JavaScript / HTML 5) - Other names: 2,5-Dimethylfuran; 2,5-Dimethylfurane

Gas phase thermochemistry data

Data compiled by: Glushko Thermocenter, Russian Academy of Sciences, Moscow
Constant pressure heat capacity of gas
Cp,gas (J/mol*K) | Temperature (K) | Reference | Comment |
---|---|---|---|
40.59 | 50. | Thermodynamics Research Center, 1997 | p=1 bar. Selected entropy and heat capacity at 298.15 K are in close agreement with statistical values calculated by [ Green J.H.S., 1977]. |
58.56 | 100. | ||
72.19 | 150. | ||
84.92 | 200. | ||
106.12 | 273.15 | ||
113.95 | 298.15 | ||
114.54 | 300. | ||
145.91 | 400. | ||
174.01 | 500. | ||
197.65 | 600. | ||
217.37 | 700. | ||
233.93 | 800. | ||
247.95 | 900. | ||
259.88 | 1000. | ||
270.08 | 1100. | ||
278.82 | 1200. | ||
286.34 | 1300. | ||
292.83 | 1400. | ||
298.45 | 1500. |

Phase change data

Data compiled as indicated in comments:
BS - Robert L. Brown and Stephen E. Stein
TRC - Thermodynamics Research Center, NIST Boulder Laboratories, Chris Muzny director
AC - William E. Acree, Jr., James S. Chickos
Quantity | Value | Units | Method | Reference | Comment |
---|---|---|---|---|---|
Tboil | 367. ± 1. | K | AVG | N/A | Average of 6 values; Individual data points |
Quantity | Value | Units | Method | Reference | Comment |
ΔvapH° | 31.8 ± 0.3 | kJ/mol | GS | Verevkin and Welle, 1998 | Based on data from 271. to 308. K.; AC |
Enthalpy of vaporization
ΔvapH (kJ/mol) | Temperature (K) | Method | Reference | Comment |
---|---|---|---|---|
32.3 ± 0.3 | 290. | GS | Verevkin and Welle, 1998 | Based on data from 271. to 308. K.; AC |

Gas phase ion energetics data

Data evaluated as indicated in comments:
HL - Edward P. Hunter and Sharon G. Lias
Data compiled as indicated in comments:
LBLHLM - Sharon G. Lias, John E. Bartmess, Joel F. Liebman, John L. Holmes, Rhoda D. Levin, and W. Gary Mallard
Quantity | Value | Units | Method | Reference | Comment |
---|---|---|---|---|---|
Proton affinity (review) | 865.9 | kJ/mol | N/A | Hunter and Lias, 1998 | HL |
Quantity | Value | Units | Method | Reference | Comment |
Gas basicity | 835.2 | kJ/mol | N/A | Hunter and Lias, 1998 | HL |
Ionization energy determinations
IE (eV) | Method | Reference | Comment |
---|---|---|---|
7.8 | PE | Veszpremi, Nyulaszi, et al., 1987 | LBLHLM |
8.25 ± 0.10 | EI | Grutzmacher and Spilker, 1985 | LBLHLM |
8.03 | PE | Veszpremi, Nyulaszi, et al., 1987 | Vertical value; LBLHLM |

Van Den Dool and Kratz RI, polar column, temperature ramp

Data compiled by: NIST Mass Spectrometry Data Center, William E. Wallace, director

Column type CapillaryCapillaryCapillaryCapillaryCapillary
Active phase DB-WaxDB-WaxDB-WaxDB-WaxDB-Wax
Column length (m) 30.30.30.30.30.
Carrier gas HeHeHeHeHe
Substrate
Column diameter (mm) 0.320.250.250.250.25
Phase thickness (μm) 0.50.250.250.250.25
Tstart (C) 40.45.45.45.40.
Tend (C) 240.240.240.240.240.
Heat rate (K/min) 5.6.6.3.6.
Initial hold (min)  10.10.10.10.
Final hold (min) 10.30.30.30.30.
I 930.958.958.952.958.
ReferenceLopez-Galilea I., Fournier N., et al., 2006Nielsen, Larsen, et al., 2004Nielsen, Larsen, et al., 2004, 2Nielsen and Poll, 2004Nielsen, Larsen, et al., 2003
Comment MSDC-RI MSDC-RI MSDC-RI MSDC-RI MSDC-RI
Column type CapillaryCapillaryCapillary
Active phase DB-WaxCarbowax 40MCP-WAX 57CB
Column length (m) 60.50.50.
Carrier gas HeHeHe
Substrate
Column diameter (mm) 0.250.320.24
Phase thickness (μm) 0.250.25
Tstart (C) 40.50.50.
Tend (C) 200.200.210.
Heat rate (K/min) 2.4.2.
Initial hold (min) 5. 5.
Final hold (min) 30.
I 946.925.934.
ReferenceKim, 2001Golovnya, Misharina, et al., 1992Baltes and Mevissen, 1988
Comment MSDC-RI MSDC-RI MSDC-RI

Van Den Dool and Kratz RI, non-polar column, temperature ramp

Data compiled by: NIST Mass Spectrometry Data Center, William E. Wallace, director

Column type CapillaryCapillaryCapillaryCapillaryCapillary
Active phase CP Sil 5 CBBPX-5BPX-5BPX-5DB-1
Column length (m) 30.50.50.50.60.
Carrier gas H2HeHeHeHe
Substrate
Column diameter (mm) 0.250.320.320.320.32
Phase thickness (μm) 0.250.50.50.251.
Tstart (C) 60.60.60.60.40.
Tend (C) 280.250.250.250.220.
Heat rate (K/min) 2.4.4.4.2.
Initial hold (min) 10.5.5.5.5.
Final hold (min) 40.10.10.10.
I 667.701.701.718.696.
ReferencePino, Marbot, et al., 2002Ames, Guy, et al., 2001Ames, Guy, et al., 2001Ames, Guy, et al., 2001, 2Kim, 2001
Comment MSDC-RI MSDC-RI MSDC-RI MSDC-RI MSDC-RI
Column type CapillaryCapillaryCapillary
Active phase SPB-1OV-101OV-101
Column length (m) 60.50.60.
Carrier gas  HeHe
Substrate
Column diameter (mm) 0.320.320.25
Phase thickness (μm) 0.250.50.50
Tstart (C) 50.50.50.
Tend (C) 200.200.200.
Heat rate (K/min) 8.4.4.
Initial hold (min)
Final hold (min)
I 685.697.684.
ReferenceMisharina, Beletsky, et al., 1994Misharina, Golovnya, et al., 1993Golovnya, Misharina, et al., 1992
Comment MSDC-RI MSDC-RI MSDC-RI

Kovats' RI, polar column, isothermal

Data compiled by: NIST Mass Spectrometry Data Center, William E. Wallace, director

Column type CapillaryPackedPackedPackedPacked
Active phase Carbowax 40MPEG-2000PEG-2000PEG-2000PEG-2000
Column length (m) 50.3.3.3.3.
Carrier gas HeHeHeHeHe
Substrate  Celite 545 (44-60 mesh)Celite 545 (44-60 mesh)Celite 545 (44-60 mesh)Celite 545 (44-60 mesh)
Column diameter (mm) 0.32
Phase thickness (μm) 0.25
Temperature (C) 100.150.152.179.180.
I 939.892.925.938.890.
ReferenceGolovnya, Misharina, et al., 1992Anderson, Jurel, et al., 1973Anderson, Jurel, et al., 1973Anderson, Jurel, et al., 1973Anderson, Jurel, et al., 1973
Comment MSDC-RI MSDC-RI MSDC-RI MSDC-RI MSDC-RI
Column type Packed
Active phase PEG-2000
Column length (m) 3.
Carrier gas He
Substrate Celite 545 (44-60 mesh)
Column diameter (mm)
Phase thickness (μm)
Temperature (C) 200.
I 950.
ReferenceAnderson, Jurel, et al., 1973
Comment MSDC-RI

Van Den Dool and Kratz RI, non-polar column, custom temperature program

Data compiled by: NIST Mass Spectrometry Data Center, William E. Wallace, director

Column type CapillaryCapillary
Active phase CP-Sil 8CB-MSBPX-5
Column length (m) 60.50.
Carrier gas HeHe
Substrate
Column diameter (mm) 0.250.32
Phase thickness (μm) 0.250.5
Program 0C(5min) => 40C/min => 40C (2min) => 4C/min => 280C0C(5min) => 40C/min => 40C(2min) => 4C/min => 280C
I 708.728.
ReferenceElmore, Mottram, et al., 2000Elmore, Mottram, et al., 1999
Comment MSDC-RI MSDC-RI

References

Thermodynamics Research Center, 1997
Thermodynamics Research Center,
Selected Values of Properties of Chemical Compounds., Thermodynamics Research Center, Texas A&M University, College Station, Texas, 1997. [all data]
Green J.H.S., 1977
Green J.H.S.,
Spectroscopic and thermodynamic properties of furan derivatives. I. 2- and 2,5-substituted compounds,
Spectrochim. Acta, 1977, A33, 843-848. [all data]
Verevkin and Welle, 1998
Verevkin, Sergey P.; Welle, Frank M.,
Structural Chemistry, 1998, 9, 3, 215-221, https://doi.org/10.1023/A:1022475115296
. [all data]
Hunter and Lias, 1998
Hunter, E.P.; Lias, S.G.,
Evaluated Gas Phase Basicities and Proton Affinities of Molecules: An Update,
J. Phys. Chem. Ref. Data, 1998, 27, 3, 413-656, https://doi.org/10.1063/1.556018
. [all data]
Veszpremi, Nyulaszi, et al., 1987
Veszpremi, T.; Nyulaszi, L.; Nagy, J.,
Ultraviolet photoelectron spectroscopy and quantum-mechanical study of alkyl- and trimethylsilyl-furanes,
J. Organomet. Chem., 1987, 331, 175. [all data]
Grutzmacher and Spilker, 1985
Grutzmacher, H.-F.; Spilker, R.,
Loss of CO from 4,6-dimethyl-2-pyrone and 2,6-dimethyl-4-pyrone radical cations,
Org. Mass Spectrom., 1985, 20, 258. [all data]