Thiourea
- Formula: CH4N2S
- Molecular weight: 76.121
- IUPAC Standard InChIKey: UMGDCJDMYOKAJW-UHFFFAOYSA-N
- CAS Registry Number: 62-56-6
- Chemical structure:
View 3d structure (requires JavaScript / HTML 5) - Other names: Urea, thio-; β-Thiopseudourea; Pseudothiourea; Pseudourea, 2-thio-; Thiocarbamide; THU; 2-Thiourea; (NH2)2CS; Sulourea; Urea, 2-thio-; USAF EK-497; Isothiourea; Rcra waste number U219; Thiocarbonic acid diamide; Thiomocovina; 2-Thiopseudourea; Tsizp 34; UN 2877; Sulfourea; NSC 5033

Gas phase thermochemistry data

Data compiled by: Hussein Y. Afeefy, Joel F. Liebman, and Stephen E. Stein
Quantity | Value | Units | Method | Reference | Comment |
---|---|---|---|---|---|
ΔfH°gas | 22.9 ± 1.6 | kJ/mol | Ccr | Gomez and Sabbah, 1982 |

Condensed phase thermochemistry data

Data compiled as indicated in comments:
ALS - Hussein Y. Afeefy, Joel F. Liebman, and Stephen E. Stein
DH - Eugene S. Domalski and Elizabeth D. Hearing
Quantity | Value | Units | Method | Reference | Comment |
---|---|---|---|---|---|
ΔfH°solid | -89.1 ± 0.5 | kJ/mol | Ccr | Gomez and Sabbah, 1982 | ALS |
ΔfH°solid | -90.0 | kJ/mol | Ccb | Becker and Roth, 1934 | hf_H2SO4.10,000H2O=-900.752 kJ/mol; ALS |
Quantity | Value | Units | Method | Reference | Comment |
ΔcH°solid | -1478.03 ± 0.45 | kJ/mol | Ccr | Gomez and Sabbah, 1982 | ALS |
ΔcH°solid | -1474.4 ± 2.1 | kJ/mol | Ccr | Sunner, 1946 | Reanalyzed by Cox and Pilcher, 1970, Original value = -1483.7 kJ/mol; ALS |
ΔcH°solid | -1488. ± 0.8 | kJ/mol | Ccb | Becker and Roth, 1934 | hf_H2SO4.10,000H2O=-900.752 kJ/mol; ALS |
Quantity | Value | Units | Method | Reference | Comment |
S°solid,1 bar | 115.8 | J/mol*K | N/A | Westrum and Chang, 1967 | DH |
Constant pressure heat capacity of solid
Cp,solid (J/mol*K) | Temperature (K) | Reference | Comment |
---|---|---|---|
96.90 | 298.15 | Torres Gomez and Sabbah, 1982 | Cp data given as 1.273 J/g*K. Data from 67WES/CHA.; DH |
96.90 | 298.15 | Westrum and Chang, 1967 | Temperature range.; DH |

Phase change data

Data compiled as indicated in comments:
TRC - Thermodynamics Research Center, NIST Boulder Laboratories, Chris Muzny director
AC - William E. Acree, Jr., James S. Chickos
ALS - Hussein Y. Afeefy, Joel F. Liebman, and Stephen E. Stein
DH - Eugene S. Domalski and Elizabeth D. Hearing
Quantity | Value | Units | Method | Reference | Comment |
---|---|---|---|---|---|
Tfus | 452.2 | K | N/A | Kim, Lee, et al., 1994 | Uncertainty assigned by TRC = 0.5 K; TRC |
Tfus | 448.05 | K | N/A | Donnelly, Drewes, et al., 1990 | Uncertainty assigned by TRC = 0.2 K; TRC |
Tfus | 453.3 | K | N/A | Zordan, Hurkot, et al., 1972 | Uncertainty assigned by TRC = 0.1 K; TRC |
Quantity | Value | Units | Method | Reference | Comment |
ΔsubH° | 112. ± 2. | kJ/mol | ME | Della Gatta, Józwiak, et al., 2000 | AC |
ΔsubH° | 111. ± 3.0 | kJ/mol | N/A | Ferro, Martino, et al., 1994 | AC |
ΔsubH° | 107.6 | kJ/mol | N/A | De Wit, Van Miltenburg, et al., 1983 | AC |
ΔsubH° | 112. ± 1.5 | kJ/mol | C | Alfonso, Gomez, et al., 1982 | AC |
ΔsubH° | 112.0 ± 1.5 | kJ/mol | C | Gomez and Sabbah, 1982 | ALS |
Enthalpy of sublimation
ΔsubH (kJ/mol) | Temperature (K) | Method | Reference | Comment |
---|---|---|---|---|
112.000 | 298.15 | N/A | Torres Gomez and Sabbah, 1982 | DH |
103.9 ± 0.3 | 387. | ME | Torres, Hernandez-Contreras, et al., 1999 | Based on data from 378. to 396. K.; AC |
109. ± 2.0 | 408. | TE | Ferro, Martino, et al., 1994 | AC |
106.6 | 384. | TE,ME | De Wit, Van Miltenburg, et al., 1983 | Based on data from 368. to 395. K.; AC |
Entropy of sublimation
ΔsubS (J/mol*K) | Temperature (K) | Reference | Comment |
---|---|---|---|
375.6 | 298.15 | Torres Gomez and Sabbah, 1982 | DH |
Enthalpy of fusion
ΔfusH (kJ/mol) | Temperature (K) | Reference | Comment |
---|---|---|---|
15.64 | 444.7 | Della Gatta, Józwiak, et al., 2000 | AC |
12.6 | 452.2 | Dou, Fuess, et al., 1994 | AC |
12.55 | 452.2 | Kim, Lee, et al., 1994, 2 | AC |

Gas phase ion energetics data

Data evaluated as indicated in comments:
HL - Edward P. Hunter and Sharon G. Lias
Data compiled as indicated in comments:
LLK - Sharon G. Lias, Rhoda D. Levin, and Sherif A. Kafafi
RDSH - Henry M. Rosenstock, Keith Draxl, Bruce W. Steiner, and John T. Herron
Quantity | Value | Units | Method | Reference | Comment |
---|---|---|---|---|---|
Proton affinity (review) | 893.7 | kJ/mol | N/A | Hunter and Lias, 1998 | HL |
Quantity | Value | Units | Method | Reference | Comment |
Gas basicity | 863.9 | kJ/mol | N/A | Hunter and Lias, 1998 | HL |
Ionization energy determinations
IE (eV) | Method | Reference | Comment |
---|---|---|---|
8.50 | EI | Baldwin, Loudon, et al., 1976 | LLK |
7.9 | PE | Debies and Rabalais, 1974 | LLK |
8.50 ± 0.05 | EI | Baldwin, Maccoll, et al., Ind. 1966 | RDSH |
8.50 | PE | Mines and Thompson, 1975 | Vertical value; LLK |
8.41 ± 0.03 | PE | Guimon, Pfister-Guillouzo, et al., 1974 | Vertical value; LLK |
8.41 | PE | Guimon, Gonbeau, et al., 1974 | Vertical value; LLK |

References

Gomez and Sabbah, 1982
Gomez, L.A.T.; Sabbah, R.,
Thermodynamique de substances soufrees. IV. Etude thermochimique de la thiouree, de la thiosemicarbazide et de la thiocarbohydrazide,
Thermochim. Acta, 1982, 57, 67-81. [all data]
Becker and Roth, 1934
Becker, G.; Roth, W.A.,
Zur bestimmung der verbrennungswarme von organischen schwefelverbindunge,
Z. Phys. Chem., 1934, 169, 287-296. [all data]
Sunner, 1946
Sunner, S.,
Determination of combustion heats of organo-sulphur compounds,
Svensk. Kim. Tidr., 1946, 58, 71-81. [all data]
Cox and Pilcher, 1970
Cox, J.D.; Pilcher, G.,
Thermochemistry of Organic and Organometallic Compounds, Academic Press, New York, 1970, 1-636. [all data]
Westrum and Chang, 1967
Westrum, E.F., Jr.; Chang, E.,
Properties thermiques cryogenetiques de la thio-uree ferroelectrique,
Colloq. Internat. du, 1967, C.N.R.S. (156), 163-173. [all data]
Torres Gomez and Sabbah, 1982
Torres Gomez, L.A.F.; Sabbah, R.,
Thermodynamic de substances soufrees. IV. Etude thermochimique de las thiouree, de la thiosemicarbazide et de la thiocarbohydrazide,
Thermochim. Acta, 1982, 57, 67-81. [all data]
Kim, Lee, et al., 1994
Kim, K.-J.; Lee, C.-H.; Ryu, S.-K.,
Solubility of Thiourea in C1 to C6 1-Alcohols,
J. Chem. Eng. Data, 1994, 39, 228-30. [all data]
Donnelly, Drewes, et al., 1990
Donnelly, J.R.; Drewes, L.A.; Johnson, R.L.; Munslow, W.D.; Knapp, K.K.; Sovocool, G.W.,
Purity and heat of fusion data for environmental standards as determined by differential scanning calorimetry,
Thermochim. Acta, 1990, 167, 2, 155, https://doi.org/10.1016/0040-6031(90)80476-F
. [all data]
Zordan, Hurkot, et al., 1972
Zordan, T.A.; Hurkot, D.G.; Peterson, M.; Hepler, L.G.,
Enthalpies and entropies of melting from differential scanning calorimetry and freezing point depressions: urea, methylurea, 1, 1-dimethylurea, 1, 3- dimethylurea, tetramethylurea, and thiourea,
Thermochim. Acta, 1972, 5, 21. [all data]
Della Gatta, Józwiak, et al., 2000
Della Gatta, Giuseppe; Józwiak, Malgorzata; Brunetti, Bruno; Abate, Lorenzo,
Enthalpies and entropies of fusion and of sublimation at the temperature 298.15 K of thiourea and sevenN-alkylthioureas,
The Journal of Chemical Thermodynamics, 2000, 32, 8, 979-997, https://doi.org/10.1006/jcht.2000.0662
. [all data]
Ferro, Martino, et al., 1994
Ferro, Daniela; Martino, Rosalba; Gatta, Giuseppe Della,
Sublimation enthalpies and entropies of thiourea, 1-methyl-2-thiourea, 1,3-dimethyl-2-thiourea, and 1,1,3,3-tetramethyl-2-thiourea,
The Journal of Chemical Thermodynamics, 1994, 26, 2, 183-190, https://doi.org/10.1006/jcht.1994.1037
. [all data]
De Wit, Van Miltenburg, et al., 1983
De Wit, H.G.M.; Van Miltenburg, J.C.; De Kruif, C.G.,
Thermodynamic properties of molecular organic crystals containing nitrogen, oxygen, and sulphur 1. Vapour pressures and enthalpies of sublimation,
The Journal of Chemical Thermodynamics, 1983, 15, 7, 651-663, https://doi.org/10.1016/0021-9614(83)90079-4
. [all data]
Alfonso, Gomez, et al., 1982
Alfonso, Luis; Gomez, Torres; Sabbah, Raphaël,
Thermodynamique de substances soufrees. IV. Etude thermochimique de la thiouree, de la thiosemicarbazide et de la thiocarbohydrazide,
Thermochimica Acta, 1982, 57, 1, 67-81, https://doi.org/10.1016/0040-6031(82)87024-X
. [all data]
Torres, Hernandez-Contreras, et al., 1999
Torres, L.A.; Hernandez-Contreras, I.; Guardado, J.A.; Gonzalez, M.G.,
A quartz crystal microbalance to determine enthalpies of sublimation at intermediate temperatures by the Knudsen effusion method,
Meas. Sci. Technol., 1999, 5, 1, 51-54, https://doi.org/10.1088/0957-0233/5/1/009
. [all data]
Dou, Fuess, et al., 1994
Dou, S.-Q.; Fuess, H.; Schmahl, W.; Strauss, R.; Weiss, A.,
Orientational order-disorder and phase transition in solid trichloromethane sulfonic acid chloride, Cl3CSO2Cl,
Z. Naturforsch., A: Phys. Sci., 1994, 49, 4-5, 594. [all data]
Kim, Lee, et al., 1994, 2
Kim, Kwang-Joo; Lee, Choul-Ho; Ryu, Sheung-Kon,
Solubility of Thiourea in C1 to C6 1-Alcohols,
J. Chem. Eng. Data, 1994, 39, 2, 228-230, https://doi.org/10.1021/je00014a008
. [all data]
Hunter and Lias, 1998
Hunter, E.P.; Lias, S.G.,
Evaluated Gas Phase Basicities and Proton Affinities of Molecules: An Update,
J. Phys. Chem. Ref. Data, 1998, 27, 3, 413-656, https://doi.org/10.1063/1.556018
. [all data]
Baldwin, Loudon, et al., 1976
Baldwin, M.A.; Loudon, A.G.; Maccoll, A.; Webb, K.S.,
The nature and fragmentation pathways of the molecular ions of some arylureas, arylthioureas, acetanilides, thioacetanilides and related compounds,
Org. Mass Spectrom., 1976, 11, 1181. [all data]
Debies and Rabalais, 1974
Debies, T.P.; Rabalais, J.W.,
Electronic structure of amino acids and ureas,
J. Electron Spectrosc. Relat. Phenom., 1974, 3, 315. [all data]
Baldwin, Maccoll, et al., Ind. 1966
Baldwin, M.; Maccoll, A.; Kirkien-Konasiewicz, A.; Saville, B.,
Ionisation potentials of the N-methylated thioureas,
Chem., Ind. 1966, 286. [all data]
Mines and Thompson, 1975
Mines, G.W.; Thompson, H.W.,
The photoelectron spectra of amides, thioamides, ureas and thioureas,
Spectrochim. Acta, 1975, 31, 137. [all data]
Guimon, Pfister-Guillouzo, et al., 1974
Guimon, C.; Pfister-Guillouzo, G.; Arbelot, M.; Chanon, M.,
Electronic structure of sulphur compounds. VII. Photoelectron spectra of thiocarbonyl J. Heterocycl. Chem..,
Tetrahedron, 1974, 30, 3831. [all data]
Guimon, Gonbeau, et al., 1974
Guimon, C.; Gonbeau, D.; Pfister-Guillouzo, G.; Asbrink, L.; Sandstrom, J.,
Electronic structure of sulphur compounds. VI. Photoelectron spectra of some simple thiocarbonyl compounds,
J. Electron Spectrosc. Relat. Phenom., 1974, 4, 49. [all data]