Ethanethioamide
- Formula: C2H5NS
- Molecular weight: 75.133
- IUPAC Standard InChIKey: YUKQRDCYNOVPGJ-UHFFFAOYSA-N
- CAS Registry Number: 62-55-5
- Chemical structure:

Gas phase thermochemistry data

Data compiled by: Hussein Y. Afeefy, Joel F. Liebman, and Stephen E. Stein
Quantity | Value | Units | Method | Reference | Comment |
---|---|---|---|---|---|
ΔfH°gas | 3.04 ± 0.29 | kcal/mol | Ccr | Inagaki, Murata, et al., 1982 | |
ΔfH°gas | 2.3 ± 0.1 | kcal/mol | Ccr | Sabbah and Gomez, 1982 |

Condensed phase thermochemistry data

Data compiled as indicated in comments:
ALS - Hussein Y. Afeefy, Joel F. Liebman, and Stephen E. Stein
DH - Eugene S. Domalski and Elizabeth D. Hearing
Quantity | Value | Units | Method | Reference | Comment |
---|---|---|---|---|---|
ΔfH°solid | -16.9 ± 0.26 | kcal/mol | Ccr | Inagaki, Murata, et al., 1982 | ALS |
ΔfH°solid | -17.45 ± 0.10 | kcal/mol | Ccr | Sabbah and Gomez, 1982 | ALS |
Quantity | Value | Units | Method | Reference | Comment |
ΔcH°solid | -485.99 ± 0.26 | kcal/mol | Ccr | Inagaki, Murata, et al., 1982 | ALS |
ΔcH°solid | -485.315 ± 0.086 | kcal/mol | Ccr | Sabbah and Gomez, 1982 | ALS |
Constant pressure heat capacity of solid
Cp,solid (cal/mol*K) | Temperature (K) | Reference | Comment |
---|---|---|---|
23.97 | 298. | Sabbah and Torres-Gomez, 1982 | Cp given as 1.335 J/g*K.; DH |

Phase change data

Data compiled as indicated in comments:
TRC - Thermodynamics Research Center, NIST Boulder Laboratories, Chris Muzny director
ALS - Hussein Y. Afeefy, Joel F. Liebman, and Stephen E. Stein
AC - William E. Acree, Jr., James S. Chickos
DH - Eugene S. Domalski and Elizabeth D. Hearing
Quantity | Value | Units | Method | Reference | Comment |
---|---|---|---|---|---|
Tfus | 386.42 | K | N/A | Donnelly, Drewes, et al., 1990 | Uncertainty assigned by TRC = 0.2 K; TRC |
Quantity | Value | Units | Method | Reference | Comment |
ΔsubH° | 19.90 ± 0.081 | kcal/mol | C | Inagaki, Murata, et al., 1982 | ALS |
ΔsubH° | 19.9 ± 0.07 | kcal/mol | C | Inagaki, Murata, et al., 1982 | See also Murata, Sakiyama, et al., 1985.; AC |
ΔsubH° | 19.79 ± 0.060 | kcal/mol | V | Sabbah and Gomez, 1982 | ALS |
ΔsubH° | 19.8 ± 0.07 | kcal/mol | C | Sabbah and Gomez, 1982 | AC |
Enthalpy of sublimation
ΔsubH (kcal/mol) | Temperature (K) | Reference | Comment |
---|---|---|---|
19.790 | 298.15 | Sabbah and Torres-Gomez, 1982 | DH |
Entropy of sublimation
ΔsubS (cal/mol*K) | Temperature (K) | Reference | Comment |
---|---|---|---|
66.37 | 298.15 | Sabbah and Torres-Gomez, 1982 | DH |
Enthalpy of fusion
ΔfusH (kcal/mol) | Temperature (K) | Reference | Comment |
---|---|---|---|
4.388 | 385.7 | Donnelly, Drewes, et al., 1990, 2 | AC |

Reaction thermochemistry data

Data compiled by: John E. Bartmess
Individual Reactions
C2H4NS- + =
By formula: C2H4NS- + H+ = C2H5NS
Quantity | Value | Units | Method | Reference | Comment |
---|---|---|---|---|---|
ΔrH° | 346.4 ± 2.1 | kcal/mol | G+TS | Decouzon, Exner, et al., 1994 | gas phase |
Quantity | Value | Units | Method | Reference | Comment |
ΔrG° | 339.4 ± 2.0 | kcal/mol | IMRE | Decouzon, Exner, et al., 1994 | gas phase |

Gas phase ion energetics data

Data evaluated as indicated in comments:
HL - Edward P. Hunter and Sharon G. Lias
L - Sharon G. Lias
Data compiled as indicated in comments:
B - John E. Bartmess
LLK - Sharon G. Lias, Rhoda D. Levin, and Sherif A. Kafafi
Quantity | Value | Units | Method | Reference | Comment |
---|---|---|---|---|---|
IE (evaluated) | 8.35 ± 0.02 | eV | N/A | N/A | L |
Quantity | Value | Units | Method | Reference | Comment |
Proton affinity (review) | 211.4 | kcal/mol | N/A | Hunter and Lias, 1998 | HL |
Quantity | Value | Units | Method | Reference | Comment |
Gas basicity | 203.8 | kcal/mol | N/A | Hunter and Lias, 1998 | HL |
Ionization energy determinations
IE (eV) | Method | Reference | Comment |
---|---|---|---|
8.36 | PE | Mines and Thompson, 1975 | LLK |
8.36 | PE | Mines and Thompson, 1975 | Vertical value; LLK |
8.33 | PE | Guimon, Gonbeau, et al., 1974 | Vertical value; LLK |
De-protonation reactions
C2H4NS- + =
By formula: C2H4NS- + H+ = C2H5NS
Quantity | Value | Units | Method | Reference | Comment |
---|---|---|---|---|---|
ΔrH° | 346.4 ± 2.1 | kcal/mol | G+TS | Decouzon, Exner, et al., 1994 | gas phase; B |
Quantity | Value | Units | Method | Reference | Comment |
ΔrG° | 339.4 ± 2.0 | kcal/mol | IMRE | Decouzon, Exner, et al., 1994 | gas phase; B |

References

Inagaki, Murata, et al., 1982
Inagaki, S.; Murata, S.; Sakiyama, M.,
Thermochemical studies on thioacetamide and tetramethylthiourea. Estimation of stablization energies due to interaction between thiocarbonyl group and neighboring nitrogen atom,
Bull. Chem. Soc. Jpn., 1982, 55, 2808-2813. [all data]
Sabbah and Gomez, 1982
Sabbah, R.; Gomez, L.A.T.,
Thermodynamique de substances soufrees. III. Etude thermochimique de la thioacetamide et de la thiobenzamide,
Thermochim. Acta, 1982, 52, 285-295. [all data]
Sabbah and Torres-Gomez, 1982
Sabbah, R.; Torres-Gomez, L.A.,
Thermodynamics of sulfur-containing compounds. III. Thermochemical study of thioacetamide and thiobenzamide,
Thermochim. Acta, 1982, 52, 285-295. [all data]
Donnelly, Drewes, et al., 1990
Donnelly, J.R.; Drewes, L.A.; Johnson, R.L.; Munslow, W.D.; Knapp, K.K.; Sovocool, G.W.,
Purity and heat of fusion data for environmental standards as determined by differential scanning calorimetry,
Thermochim. Acta, 1990, 167, 2, 155, https://doi.org/10.1016/0040-6031(90)80476-F
. [all data]
Murata, Sakiyama, et al., 1985
Murata, S.; Sakiyama, M.; Seki, S.,
Sublimation calorimetric studies using a calvet microcalorimeter,
Thermochimica Acta, 1985, 88, 1, 121-126, https://doi.org/10.1016/0040-6031(85)85419-8
. [all data]
Donnelly, Drewes, et al., 1990, 2
Donnelly, J.R.; Drewes, L.A.; Johnson, R.L.; Munslow, W.D.; Knapp, K.K.; Sovocool, G.W.,
Purity and heat of fusion data for environmental standards as determined by differential scanning calorimetry,
Thermochimica Acta, 1990, 167, 2, 155-187, https://doi.org/10.1016/0040-6031(90)80476-F
. [all data]
Decouzon, Exner, et al., 1994
Decouzon, M.; Exner, O.; Gal, J.F.; Maria, P.C.; Waisser, K.,
Acidity and basicity of thiocarboxamides in the gas phase,
J. Phys. Org. Chem., 1994, 7, 9, 511, https://doi.org/10.1002/poc.610070907
. [all data]
Hunter and Lias, 1998
Hunter, E.P.; Lias, S.G.,
Evaluated Gas Phase Basicities and Proton Affinities of Molecules: An Update,
J. Phys. Chem. Ref. Data, 1998, 27, 3, 413-656, https://doi.org/10.1063/1.556018
. [all data]
Mines and Thompson, 1975
Mines, G.W.; Thompson, H.W.,
The photoelectron spectra of amides, thioamides, ureas and thioureas,
Spectrochim. Acta, 1975, 31, 137. [all data]
Guimon, Gonbeau, et al., 1974
Guimon, C.; Gonbeau, D.; Pfister-Guillouzo, G.; Asbrink, L.; Sandstrom, J.,
Electronic structure of sulphur compounds. VI. Photoelectron spectra of some simple thiocarbonyl compounds,
J. Electron Spectrosc. Relat. Phenom., 1974, 4, 49. [all data]