Urea, ethyl-
- Formula: C3H8N2O
- Molecular weight: 88.1084
- IUPAC Standard InChIKey: RYECOJGRJDOGPP-UHFFFAOYSA-N
- CAS Registry Number: 625-52-5
- Chemical structure:

Condensed phase thermochemistry data

Data compiled by: Hussein Y. Afeefy, Joel F. Liebman, and Stephen E. Stein
Quantity | Value | Units | Method | Reference | Comment |
---|---|---|---|---|---|
ΔfH°solid | -357.76 ± 0.74 | kJ/mol | Ccb | Kabo, Miroshnichenko, et al., 1990 | see Simirsky, Kabo, et al., 1987 and Simirskii, Kabo, et al., 1986 |
ΔfH°solid | -340. | kJ/mol | Ccb | Schmidt and Becker, 1933 | |
Quantity | Value | Units | Method | Reference | Comment |
ΔcH°solid | -1966.10 ± 0.61 | kJ/mol | Ccb | Kabo, Miroshnichenko, et al., 1990 | see Simirsky, Kabo, et al., 1987 and Simirskii, Kabo, et al., 1986 |
ΔcH°solid | -1976. | kJ/mol | Ccb | Schmidt and Becker, 1933 |

Phase change data

Data compiled as indicated in comments:
TRC - Thermodynamics Research Center, NIST Boulder Laboratories, Chris Muzny director
AC - William E. Acree, Jr., James S. Chickos
ALS - Hussein Y. Afeefy, Joel F. Liebman, and Stephen E. Stein
DH - Eugene S. Domalski and Elizabeth D. Hearing

Quantity Value Units Method Reference Comment
Tfus367.8KN/ADellaGatta and Ferro, 1987Uncertainty assigned by TRC = 0.5 K; TRC
Quantity Value Units Method Reference Comment
Ttriple368.9KN/AFerloni and DellaGatta, 1995Crystal phase 1 phase; Uncertainty assigned by TRC = 0.5 K; TRC
Ttriple365.0KN/AKabo, Miroshnichenko, et al., 1990Uncertainty assigned by TRC = 0.00001 K; TRC

Enthalpy of sublimation

ΔsubH (kcal/mol) Temperature (K) Method Reference Comment
23.4 ± 0.26344.MEZaitsau, Kabo, et al., 2003Based on data from 323. - 364. K.; AC
23.4 ± 0.26350.MEZaitsau, Kabo, et al., 2003Based on data from 323. - 364. K.; AC
23.0 ± 0.26350.CZaitsau, Kabo, et al., 2003AC
24.0 ± 0.2337.CKabo, Miroshnichenko, et al., 1990, 2see Simirsky, Kabo, et al., 1987 and Simirskii, Kabo, et al., 1986; ALS
21.9 ± 0.29354.TEPiacente, Ferro, et al., 1990Based on data from 333. - 365. K. See also Ferro, Barone, et al., 1987.; AC

Enthalpy of fusion

ΔfusH (kcal/mol) Temperature (K) Method Reference Comment
3.3317367.8N/ADella Gatta and Ferro, 1987DH
2.3356.7DSCHashimoto, Tajima, et al., 2005AC
3.501368.9DSCFerloni and Gatta, 1995AC
3.439365.1N/AKabo, Miroshnichenko, et al., 1990, 2AC

Entropy of fusion

ΔfusS (cal/mol*K) Temperature (K) Reference Comment
9.06367.8Della Gatta and Ferro, 1987DH

In addition to the Thermodynamics Research Center (TRC) data available from this site, much more physical and chemical property data is available from the following TRC products:

References

Kabo, Miroshnichenko, et al., 1990
Kabo, G.Ya.; Miroshnichenko, E.A.; Frenkel, M.L.; Kozyro, A.A.; Simirskii, V.V.; Krasulin, A.P.; Vorob'eva, V.P.; Lebedev, Yu.A.,
Thermochemistry of urea alkyl derivatives,
Bull. Acad. Sci. USSR, Div. Chem. Sci., 1990, 662-667. [all data]
Simirsky, Kabo, et al., 1987
Simirsky, V.V.; Kabo, G.J.; Frenkel, M.L.,
Additivity of the enthalpies of formation of urea derivatives in the crystalline state,
J. Chem. Thermodyn., 1987, 19, 1121-1127. [all data]
Simirskii, Kabo, et al., 1986
Simirskii, V.V.; Kabo, G.Ya.; Frenkel, M.L.,
Enthalpies of combustion and of formation of monoalkyl derivatives of urea,
Russ. J. Phys. Chem. (Engl. Transl.), 1986, 60, 1233-1234. [all data]
Schmidt and Becker, 1933
Schmidt, V.A.; Becker, F.,
Die Bildungswarme von Nitrocellulofen, Nitroglycerin und anderen widuigen Beltandteilen von Treibmitteln,
Z. Gesamte Schiess Sprengstoffwes., 1933, 33, 280-282. [all data]