1-Propene, 3-nitro-
- Formula: C3H5NO2
- Molecular weight: 87.0773
- IUPAC Standard InChIKey: VLISOFDTMSFZPP-UHFFFAOYSA-N
- CAS Registry Number: 625-46-7
- Chemical structure:
View 3d structure (requires JavaScript / HTML 5) - Species with the same structure:

Phase change data

Data compiled by: Robert L. Brown and Stephen E. Stein
Quantity | Value | Units | Method | Reference | Comment |
---|---|---|---|---|---|
Tboil | 400.7 | K | N/A | Weast and Grasselli, 1989 |

Gas phase ion energetics data

Data compiled by: Sharon G. Lias and Joel F. Liebman
Ionization energy determinations
IE (eV) | Method | Reference | Comment |
---|---|---|---|
10.4 | PE | Chin, Mok, et al., 1991 | |
10.65 | PE | Chin, Mok, et al., 1991 | Vertical value |

References

Weast and Grasselli, 1989
CRC Handbook of Data on Organic Compounds, 2nd Editon, Weast,R.C and Grasselli, J.G., ed(s)., CRC Press, Inc., Boca Raton, FL, 1989, 1. [all data]
Chin, Mok, et al., 1991
Chin, W.S.; Mok, C.Y.; Huang, H.H.,
He I and He II photoelectron spectra of isomeric nitropropenes,
J. Chem. Soc. Faraday Trans., 1991, 87, 1685. [all data]