Acetic acid, methoxy-
- Formula: C3H6O3
- Molecular weight: 90.0779
- IUPAC Standard InChIKey: RMIODHQZRUFFFF-UHFFFAOYSA-N
- CAS Registry Number: 625-45-6
- Chemical structure:
View 3d structure (requires JavaScript / HTML 5) - Other names: Methoxyacetic acid; 2-Methoxyacetic acid; CH3OCH2COOH; Methoxyethanoic acid

Phase change data

Data compiled as indicated in comments:
BS - Robert L. Brown and Stephen E. Stein
AC - William E. Acree, Jr., James S. Chickos
Quantity | Value | Units | Method | Reference | Comment |
---|---|---|---|---|---|
Tboil | 476.7 | K | N/A | Weast and Grasselli, 1989 | BS |
Reduced pressure boiling point
Tboil (K) | Pressure (bar) | Reference | Comment |
---|---|---|---|
369.2 | 0.017 | Weast and Grasselli, 1989 | BS |
Enthalpy of vaporization
ΔvapH (kJ/mol) | Temperature (K) | Method | Reference | Comment |
---|---|---|---|---|
54.5 | 340. | A | Stephenson and Malanowski, 1987 | Based on data from 325. to 477. K. See also Stull, 1947.; AC |
Antoine Equation Parameters
log10(P) = A − (B / (T + C))
P = vapor pressure (bar)
T = temperature (K)
View plot Requires a JavaScript / HTML 5 canvas capable browser.
Temperature (K) | A | B | C | Reference | Comment |
---|---|---|---|---|---|
325.7 to 477. | 5.93774 | 2764.61 | -11.756 | Stull, 1947 | Coefficents calculated by NIST from author's data. |

Reaction thermochemistry data

Data compiled as indicated in comments:
B - John E. Bartmess
ALS - Hussein Y. Afeefy, Joel F. Liebman, and Stephen E. Stein
Individual Reactions
By formula: C3H5O3- + H+ = C3H6O3
Quantity | Value | Units | Method | Reference | Comment |
---|---|---|---|---|---|
ΔrH° | 1431. ± 8.8 | kJ/mol | G+TS | Caldwell, Renneboog, et al., 1989 | gas phase; B |
ΔrH° | 1433. ± 8.8 | kJ/mol | G+TS | Taft and Topsom, 1987 | gas phase; B |
Quantity | Value | Units | Method | Reference | Comment |
ΔrG° | 1403. ± 8.4 | kJ/mol | IMRE | Caldwell, Renneboog, et al., 1989 | gas phase; B |
ΔrG° | 1406. ± 8.4 | kJ/mol | IMRE | Taft and Topsom, 1987 | gas phase; B |
By formula: C4H8O3 + H2O = C3H6O3 + CH4O
Quantity | Value | Units | Method | Reference | Comment |
---|---|---|---|---|---|
ΔrH° | -65.6 ± 5.9 | kJ/mol | Eqk | Guthrie and Cullimore, 1980 | liquid phase; ALS |
By formula: C4H6O3 + 2C3H6O3 = C6H10O5 + 2C2H4O2
Quantity | Value | Units | Method | Reference | Comment |
---|---|---|---|---|---|
ΔrH° | 0.0 | kJ/mol | Eqk | Utkin, Bogel'fer, et al., 1991 | liquid phase; NMR; ALS |

Gas phase ion energetics data

Data compiled as indicated in comments:
B - John E. Bartmess
LL - Sharon G. Lias and Joel F. Liebman
Appearance energy determinations
Ion | AE (eV) | Other Products | Method | Reference | Comment |
---|---|---|---|---|---|
CHO2+ | 10.68 | C2H5O | EI | Holmes, Lossing, et al., 1991 | LL |
De-protonation reactions
By formula: C3H5O3- + H+ = C3H6O3
Quantity | Value | Units | Method | Reference | Comment |
---|---|---|---|---|---|
ΔrH° | 1431. ± 8.8 | kJ/mol | G+TS | Caldwell, Renneboog, et al., 1989 | gas phase; B |
ΔrH° | 1433. ± 8.8 | kJ/mol | G+TS | Taft and Topsom, 1987 | gas phase; B |
Quantity | Value | Units | Method | Reference | Comment |
ΔrG° | 1403. ± 8.4 | kJ/mol | IMRE | Caldwell, Renneboog, et al., 1989 | gas phase; B |
ΔrG° | 1406. ± 8.4 | kJ/mol | IMRE | Taft and Topsom, 1987 | gas phase; B |
Anion protonation reactions
By formula: C3H5O3- + H+ = C3H6O3
Quantity | Value | Units | Method | Reference | Comment |
---|---|---|---|---|---|
ΔrH° | 1431. ± 8.8 | kJ/mol | G+TS | Caldwell, Renneboog, et al., 1989 | gas phase; B |
ΔrH° | 1433. ± 8.8 | kJ/mol | G+TS | Taft and Topsom, 1987 | gas phase; B |
Quantity | Value | Units | Method | Reference | Comment |
ΔrG° | 1403. ± 8.4 | kJ/mol | IMRE | Caldwell, Renneboog, et al., 1989 | gas phase; B |
ΔrG° | 1406. ± 8.4 | kJ/mol | IMRE | Taft and Topsom, 1987 | gas phase; B |

References

Weast and Grasselli, 1989
CRC Handbook of Data on Organic Compounds, 2nd Editon, Weast,R.C and Grasselli, J.G., ed(s)., CRC Press, Inc., Boca Raton, FL, 1989, 1. [all data]
Stephenson and Malanowski, 1987
Stephenson, Richard M.; Malanowski, Stanislaw,
Handbook of the Thermodynamics of Organic Compounds, 1987, https://doi.org/10.1007/978-94-009-3173-2
. [all data]
Stull, 1947
Stull, Daniel R.,
Vapor Pressure of Pure Substances. Organic and Inorganic Compounds,
Ind. Eng. Chem., 1947, 39, 4, 517-540, https://doi.org/10.1021/ie50448a022
. [all data]
Caldwell, Renneboog, et al., 1989
Caldwell, G.; Renneboog, R.; Kebarle, P.,
Gas Phase Acidities of Aliphatic Carboxylic Acids, Based on Measurements of Proton Transfer Equilibria,
Can. J. Chem., 1989, 67, 4, 661, https://doi.org/10.1139/v89-092
. [all data]
Taft and Topsom, 1987
Taft, R.W.; Topsom, R.D.,
The Nature and Analysis of Substituent Effects,
Prog. Phys. Org. Chem., 1987, 16, 1. [all data]
Guthrie and Cullimore, 1980
Guthrie, J.P.; Cullimore, P.A.,
Effect of the acyl substituent on the equilibrium constant for hydration of esters,
Can. J. Chem., 1980, 58, 1281-1294. [all data]
Utkin, Bogel'fer, et al., 1991
Utkin, A.Yu.; Bogel'fer, L.Ya.; Chimishkyan, A.L.,
Reversible reactions in the acidolysis of methyoxyacetic acid by acetic anhydride,
Russ. J. Phys. Chem. (Engl. Transl.), 1991, 65, 1049-1059, In original 1974. [all data]
Holmes, Lossing, et al., 1991
Holmes, J.L.; Lossing, F.P.; Mayer, P.M.,
Heats of formation of oxygen-containing organic free radicals from appearance energy measurements,
J. Am. Chem. Soc., 1991, 113, 9723. [all data]