crotonoyl chloride
- Formula: C4H5ClO
- Molecular weight: 104.535
- IUPAC Standard InChIKey: RJUIDDKTATZJFE-NSCUHMNNSA-N
- CAS Registry Number: 625-35-4
- Chemical structure:
View 3d structure (requires JavaScript / HTML 5) - Stereoisomers:
- Other names: 2-Butenoyl chloride, (E)-

Phase change data

Data compiled by: Robert L. Brown and Stephen E. Stein
Quantity | Value | Units | Method | Reference | Comment |
---|---|---|---|---|---|
Tboil | 394.7 | K | N/A | Aldrich Chemical Company Inc., 1990 |

Gas phase ion energetics data

Data compiled as indicated in comments:
LLK - Sharon G. Lias, Rhoda D. Levin, and Sherif A. Kafafi
Ionization energy determinations
IE (eV) | Method | Reference | Comment |
---|---|---|---|
9.4 | PE | Mohmand, Hirabayashi, et al., 1981 | LLK |

References

Aldrich Chemical Company Inc., 1990
Aldrich Chemical Company Inc.,
Catalog Handbook of Fine Chemicals, Aldrich Chemical Company, Inc., Milwaukee WI, 1990, 1. [all data]
Mohmand, Hirabayashi, et al., 1981
Mohmand, S.; Hirabayashi, T.; Bock, H.,
Gasphasen-reaktionen, 22. Thermische erzeugung von C4H4O: Vinylketen und ethylidenketen,
Chem. Ber., 1981, 114, 1609. [all data]