FCN+
- Formula: CFN+
- Molecular weight: 45.0153
- CAS Registry Number: 62532-69-8

Vibrational and/or electronic energy levels

Data compiled by: Marilyn E. Jacox
State: C
Energy (cm-1) |
Med. | Transition | λmin (nm) |
λmax (nm) |
References | ||
---|---|---|---|---|---|---|---|
Tx = 74700 ± 1000 | gas | Bieri, 1977 | |||||
State: B
Energy (cm-1) |
Med. | Transition | λmin (nm) |
λmax (nm) |
References | ||
---|---|---|---|---|---|---|---|
Tx = 48100 ± 1000 | gas | Bieri, 1977 | |||||
State: A
Energy (cm-1) |
Med. | Transition | λmin (nm) |
λmax (nm) |
References | ||
---|---|---|---|---|---|---|---|
To = 9200 ± 500 | gas | Bieri, 1977 | |||||
Vib. sym. |
No. | Approximate type of mode |
cm-1 | Med. | Method | References | |
---|---|---|---|---|---|---|---|
Σ+ | 3 | CF stretch | 1230 ± 160 | gas | PE | Bieri, 1977 | |
State: X
Vib. sym. |
No. | Approximate type of mode |
cm-1 | Med. | Method | References | |
---|---|---|---|---|---|---|---|
Σ+ | 1 | CN stretch | 2100 ± 160 | gas | PE | Bieri, 1977 | |
Additional references: Jacox, 1994, page 79

References

Bieri, 1977
Bieri, G.,
Cyanogen fluoride: A photoelectron spectroscopic investigation,
Chem. Phys. Lett., 1977, 46, 107. [all data]
Jacox, 1994
Jacox, M.E.,
Vibrational and electronic energy levels of polyatomic transient molecules, American Chemical Society, Washington, DC, 1994, 464. [all data]