1-Butanol, 3,3-dimethyl-
- Formula: C6H14O
- Molecular weight: 102.1748
- IUPAC Standard InChIKey: DUXCSEISVMREAX-UHFFFAOYSA-N
- CAS Registry Number: 624-95-3
- Chemical structure:
View 3d structure (requires JavaScript / HTML 5) - Other names: 3,3-Dimethyl-1-butanol; 3,3-dimethylbutan-1-ol

Condensed phase thermochemistry data

Data compiled by: Eugene S. Domalski and Elizabeth D. Hearing
Constant pressure heat capacity of liquid
Cp,liquid (J/mol*K) | Temperature (K) | Reference |
---|---|---|
236.08 | 298.15 | Benson, Kumaran, et al., 1986 |

Phase change data

Data compiled as indicated in comments:
BS - Robert L. Brown and Stephen E. Stein
TRC - Thermodynamics Research Center, NIST Boulder Laboratories, Chris Muzny director
AC - William E. Acree, Jr., James S. Chickos
Quantity | Value | Units | Method | Reference | Comment |
---|---|---|---|---|---|
Tboil | 415. ± 2. | K | AVG | N/A | Average of 10 values; Individual data points |
Quantity | Value | Units | Method | Reference | Comment |
ΔvapH° | 58.0 ± 0.2 | kJ/mol | GS | Kulikov, Verevkin, et al., 2001 | Based on data from 276. to 312. K.; AC |
Enthalpy of vaporization
ΔvapH (kJ/mol) | Temperature (K) | Method | Reference | Comment |
---|---|---|---|---|
58.6 ± 0.1 | 328. | C | Ulbig, Klüppel, et al., 1996 | AC |
55.4 ± 0.1 | 343. | C | Ulbig, Klüppel, et al., 1996 | AC |
52.4 ± 0.1 | 358. | C | Ulbig, Klüppel, et al., 1996 | AC |
50.8 | 334. | A | Stephenson and Malanowski, 1987 | Based on data from 319. to 424. K.; AC |
49.4 | 368. | N/A | Wilhoit and Zwolinski, 1973 | Based on data from 353. to 417. K.; AC |
Enthalpy of fusion
ΔfusH (kJ/mol) | Temperature (K) | Reference | Comment |
---|---|---|---|
9.54 | 235.7 | Massalska-Arodz, Nakamoto, et al., 2004 | AC |

Reaction thermochemistry data

Data compiled by: John E. Bartmess
Individual Reactions
C6H13O- + =
By formula: C6H13O- + H+ = C6H14O
Quantity | Value | Units | Method | Reference | Comment |
---|---|---|---|---|---|
ΔrH° | 1555. ± 8.8 | kJ/mol | G+TS | Higgins and Bartmess, 1998 | gas phase |
ΔrH° | 1561. ± 8.4 | kJ/mol | CIDC | Haas and Harrison, 1993 | gas phase; Both metastable and 50 eV collision energy. |
ΔrH° | 1559. ± 12. | kJ/mol | G+TS | Boand, Houriet, et al., 1983 | gas phase; value altered from reference due to change in acidity scale |
Quantity | Value | Units | Method | Reference | Comment |
ΔrG° | 1527. ± 8.4 | kJ/mol | IMRE | Higgins and Bartmess, 1998 | gas phase |
ΔrG° | 1533. ± 8.8 | kJ/mol | H-TS | Haas and Harrison, 1993 | gas phase; Both metastable and 50 eV collision energy. |
ΔrG° | 1531. ± 11. | kJ/mol | CIDC | Boand, Houriet, et al., 1983 | gas phase; value altered from reference due to change in acidity scale |

Gas phase ion energetics data

Data compiled as indicated in comments:
B - John E. Bartmess
LL - Sharon G. Lias and Joel F. Liebman
Appearance energy determinations
Ion | AE (eV) | Other Products | Method | Reference | Comment |
---|---|---|---|---|---|
C2H5O+ | 10.14 | C4H9 | EI | Holmes, Lossing, et al., 1991 | LL |
De-protonation reactions
C6H13O- + =
By formula: C6H13O- + H+ = C6H14O
Quantity | Value | Units | Method | Reference | Comment |
---|---|---|---|---|---|
ΔrH° | 1555. ± 8.8 | kJ/mol | G+TS | Higgins and Bartmess, 1998 | gas phase; B |
ΔrH° | 1561. ± 8.4 | kJ/mol | CIDC | Haas and Harrison, 1993 | gas phase; Both metastable and 50 eV collision energy.; B |
ΔrH° | 1559. ± 12. | kJ/mol | G+TS | Boand, Houriet, et al., 1983 | gas phase; value altered from reference due to change in acidity scale; B |
Quantity | Value | Units | Method | Reference | Comment |
ΔrG° | 1527. ± 8.4 | kJ/mol | IMRE | Higgins and Bartmess, 1998 | gas phase; B |
ΔrG° | 1533. ± 8.8 | kJ/mol | H-TS | Haas and Harrison, 1993 | gas phase; Both metastable and 50 eV collision energy.; B |
ΔrG° | 1531. ± 11. | kJ/mol | CIDC | Boand, Houriet, et al., 1983 | gas phase; value altered from reference due to change in acidity scale; B |

Kovats' RI, polar column, isothermal

Data compiled by: NIST Mass Spectrometry Data Center, William E. Wallace, director

Column type CapillaryCapillary
Active phase Carbowax 20MCarbowax 20M
Column length (m) 50.50.
Carrier gas N2N2
Substrate
Column diameter (mm) 0.230.23
Phase thickness (μm)
Temperature (C) 80.90.
I 1276.1276.
ReferenceBoneva, 1987Boneva, 1987
Comment MSDC-RI MSDC-RI

References

Benson, Kumaran, et al., 1986
Benson, G.C.; Kumaran, M.K.; Halpin, C.J.; D'Arcy, P.J.,
Thermodynamic properties for (3,3-dimethylbutan-1-ol + n-hexane) at 298.15 K,
J. Chem. Thermodynam., 1986, 18, 1007-1014. [all data]
Kulikov, Verevkin, et al., 2001
Kulikov, Dmitry; Verevkin, Sergey P.; Heintz, Andreas,
Determination of Vapor Pressures and Vaporization Enthalpies of the Aliphatic Branched C 5 and C 6 Alcohols,
J. Chem. Eng. Data, 2001, 46, 6, 1593-1600, https://doi.org/10.1021/je010187p
. [all data]
Ulbig, Klüppel, et al., 1996
Ulbig, P.; Klüppel, M.; Schulz, S.,
Extension of the UNIVAP group contribution method: enthalpies of vaporization of special alcohols in the temperature range from 313 to 358 K,
Thermochimica Acta, 1996, 271, 9-21, https://doi.org/10.1016/0040-6031(95)02595-2
. [all data]
Stephenson and Malanowski, 1987
Stephenson, Richard M.; Malanowski, Stanislaw,
Handbook of the Thermodynamics of Organic Compounds, 1987, https://doi.org/10.1007/978-94-009-3173-2
. [all data]
Wilhoit and Zwolinski, 1973
Wilhoit, R.C.; Zwolinski, B.J.,
Physical and thermodynamic properties of aliphatic alcohols,
J. Phys. Chem. Ref. Data Suppl., 1973, 1, 2, 1. [all data]
Massalska-Arodz, Nakamoto, et al., 2004
Massalska-Arodz, Maria; Nakamoto, Tadahiro; Wasiutynski, Tadeusz; Mayer, Jacek; Krawczyk, Jan; Sorai, Michio,
Thermal and relaxational properties of glass-forming material, 3,3-dimethyl-1-butanol,
The Journal of Chemical Thermodynamics, 2004, 36, 10, 877-888, https://doi.org/10.1016/j.jct.2004.06.007
. [all data]
Higgins and Bartmess, 1998
Higgins, P.R.; Bartmess, J.E.,
The Gas Phase Acidities of Long Chain Alcohols.,
Int. J. Mass Spectrom., 1998, 175, 1-2, 71-79, https://doi.org/10.1016/S0168-1176(98)00125-6
. [all data]
Haas and Harrison, 1993
Haas, M.J.; Harrison, A.G.,
The Fragmentation of Proton-Bound Cluster Ions and the Gas-Phase Acidities of Alcohols,
Int. J. Mass Spectrom. Ion Proc., 1993, 124, 2, 115, https://doi.org/10.1016/0168-1176(93)80003-W
. [all data]
Boand, Houriet, et al., 1983
Boand, G.; Houriet, R.; Baumann, T.,
The gas phase acidity of aliphatic alcohols,
J. Am. Chem. Soc., 1983, 105, 2203. [all data]
Holmes, Lossing, et al., 1991
Holmes, J.L.; Lossing, F.P.; Mayer, P.M.,
Heats of formation of oxygen-containing organic free radicals from appearance energy measurements,
J. Am. Chem. Soc., 1991, 113, 9723. [all data]