Hydrazine, ethyl-
- Formula: C2H8N2
- Molecular weight: 60.0983
- IUPAC Standard InChIKey: WHRIKZCFRVTHJH-UHFFFAOYSA-N
- CAS Registry Number: 624-80-6
- Chemical structure:
View 3d structure (requires JavaScript / HTML 5) - Other names: Ethylhydrazine; C2H5NHNH2; 1-Ethylhydrazine; N-Ethylhydrazine; 6629-60-3 (oxalate)

Gas phase ion energetics data

Data compiled by: Sharon G. Lias, Rhoda D. Levin, and Sherif A. Kafafi
Ionization energy determinations
IE (eV) | Method | Reference | Comment |
---|---|---|---|
8.12 ± 0.05 | PE | Vovna, Vilesov, et al., 1975 | Vertical value |
9.20 | PE | Nelsen and Buschek, 1974 | Vertical value |

Normal alkane RI, non-polar column, temperature ramp

Column type | Active phase | I | Reference | Comment |
---|---|---|---|---|
Capillary | OV-101 | 643. | Zenkevich, 2005 | 25. m/0.20 mm/0.10 μm, N2/He, 6. K/min; Tstart: 50. C; Tend: 250. C |

References

Vovna, Vilesov, et al., 1975
Vovna, V.I.; Vilesov, F.I.; Lopatin, S.N.,
Photoelectron spectra of hydrazine and some alkyl derivatives,
Opt. Spectrosc., 1975, 38, 143. [all data]
Nelsen and Buschek, 1974
Nelsen, S.F.; Buschek, J.M.,
Photoelectron spectra of hydrazines. III. Evidence for similar lone pair-lone pair dihedral angles for acyclic hydrazines,
J. Am. Chem. Soc., 1974, 96, 2392. [all data]
Zenkevich, 2005
Zenkevich, I.G.,
Experimentally measured retention indices., 2005. [all data]