Ethyl isocyanide
- Formula: C3H5N
- Molecular weight: 55.0785
- IUPAC Standard InChIKey: BPCWCZCOOFUXGQ-UHFFFAOYSA-N
- CAS Registry Number: 624-79-3
- Chemical structure:

Gas phase thermochemistry data

Data compiled by: Donald R. Burgess, Jr.
Quantity | Value | Units | Method | Reference | Comment |
---|---|---|---|---|---|
ΔfH°gas | 132.6 | kJ/mol | N/A | Lemoult, 1906 | Value computed using ΔfHliquid° value of 99.6 kj/mol from Lemoult, 1906 and ΔvapH° value of 33 kj/mol from missing citation. |

Condensed phase thermochemistry data

Data compiled by: Hussein Y. Afeefy, Joel F. Liebman, and Stephen E. Stein
Quantity | Value | Units | Method | Reference | Comment |
---|---|---|---|---|---|
ΔfH°liquid | 99.6 | kJ/mol | Ccb | Lemoult, 1906 | |
Quantity | Value | Units | Method | Reference | Comment |
ΔcH°liquid | -2005. | kJ/mol | Ccb | Lemoult and Jungfleisch, 1909 | |
ΔcH°liquid | -2005. | kJ/mol | Ccb | Lemoult, 1906 |

Gas phase ion energetics data

Data evaluated as indicated in comments:
HL - Edward P. Hunter and Sharon G. Lias
Data compiled as indicated in comments:
LBLHLM - Sharon G. Lias, John E. Bartmess, Joel F. Liebman, John L. Holmes, Rhoda D. Levin, and W. Gary Mallard
RDSH - Henry M. Rosenstock, Keith Draxl, Bruce W. Steiner, and John T. Herron
Quantity | Value | Units | Method | Reference | Comment |
---|---|---|---|---|---|
Proton affinity (review) | 851.3 | kJ/mol | N/A | Hunter and Lias, 1998 | HL |
Quantity | Value | Units | Method | Reference | Comment |
Gas basicity | 818.9 | kJ/mol | N/A | Hunter and Lias, 1998 | HL |
Ionization energy determinations
IE (eV) | Method | Reference | Comment |
---|---|---|---|
11.2 ± 0.25 | EI | Chess, Lapp, et al., 1982 | LBLHLM |
11.38 | EI | Heerma and deRidder, 1970 | RDSH |
11.2 ± 0.1 | EI | Gillis and Occolowitz, 1963 | RDSH |
Appearance energy determinations
Ion | AE (eV) | Other Products | Method | Reference | Comment |
---|---|---|---|---|---|
C2H2N+ | 14.17 | CH3 | EI | Heerma and deRidder, 1970 | RDSH |
C2H4+ | 12.83 | ? | EI | Heerma and deRidder, 1970 | RDSH |
C2H5+ | 12.94 | CN | EI | Heerma and deRidder, 1970 | RDSH |
C3H4N+ | 12.51 | H | EI | Heerma and deRidder, 1970 | RDSH |

Phase change data

Data compiled by: Hussein Y. Afeefy, Joel F. Liebman, and Stephen E. Stein
Quantity | Value | Units | Method | Reference | Comment |
---|---|---|---|---|---|
ΔvapH° | 33. | kJ/mol | V | Baghal-Vayjooee, Collister, et al., 1977 | Heat of isomerization |

Reaction thermochemistry data

Data compiled by: Hussein Y. Afeefy, Joel F. Liebman, and Stephen E. Stein
Individual Reactions
By formula: C3H5N = C3H5N
Quantity | Value | Units | Method | Reference | Comment |
---|---|---|---|---|---|
ΔrH° | -21.5 ± 1.0 | kcal/mol | Cm | Baghal-Vayjooee, Collister, et al., 1977 | gas phase; Heat of isomerization |

References

Lemoult, 1906
Lemoult, P.,
Carbylamines et nitriles.,
Compt. Rend., 1906, 143, 902-904. [all data]
Lemoult and Jungfleisch, 1909
Lemoult, M.P.; Jungfleisch, M.E.,
Thermochimie. - Comparaisons entre les nitriles et les carbylamines,
Compt. Rend., 1909, 148, 1602-1604. [all data]
Hunter and Lias, 1998
Hunter, E.P.; Lias, S.G.,
Evaluated Gas Phase Basicities and Proton Affinities of Molecules: An Update,
J. Phys. Chem. Ref. Data, 1998, 27, 3, 413-656, https://doi.org/10.1063/1.556018
. [all data]
Chess, Lapp, et al., 1982
Chess, E.K.; Lapp, R.L.; Gross, M.L.,
The question of tautomerism of alkylnitrile and isonitrile radical cations,
Org. Mass Spectrom., 1982, 17, 475. [all data]
Heerma and deRidder, 1970
Heerma, W.; deRidder, J.J.,
The electron-impact induced fragmentation of some alkyl isocyanides and alpha-branched alkyl cyanides,
Org. Mass Spectrom., 1970, 3, 1439. [all data]
Gillis and Occolowitz, 1963
Gillis, R.G.; Occolowitz, J.L.,
Isocyanides. III. Electron impact study of aliphatic isocyanides,
J. Org. Chem., 1963, 28, 2924. [all data]