Ethanol, 2-iodo-
- Formula: C2H5IO
- Molecular weight: 171.9650
- IUPAC Standard InChIKey: QSECPQCFCWVBKM-UHFFFAOYSA-N
- CAS Registry Number: 624-76-0
- Chemical structure:
View 3d structure (requires JavaScript / HTML 5) - Other names: Ethylene iodohydrin; Iodoethanol; 2-Iodoethanol

Phase change data

Data compiled by: Robert L. Brown and Stephen E. Stein
Reduced pressure boiling point
Tboil (K) | Pressure (bar) | Reference |
---|---|---|
358.2 | 0.033 | Aldrich Chemical Company Inc., 1990 |

Gas phase ion energetics data

Data compiled as indicated in comments:
LLK - Sharon G. Lias, Rhoda D. Levin, and Sherif A. Kafafi
LL - Sharon G. Lias and Joel F. Liebman
LBLHLM - Sharon G. Lias, John E. Bartmess, Joel F. Liebman, John L. Holmes, Rhoda D. Levin, and W. Gary Mallard
Ionization energy determinations
IE (eV) | Method | Reference | Comment |
---|---|---|---|
9.62 | PE | Baker, Betteridge, et al., 1971 | LLK |
9.62 | PE | Baker, Betteridge, et al., 1971 | LLK |
9.73 | PE | Hoppilliard and Solgadi, 1980 | Vertical value; Gauche conformer; LLK |
9.60 | PE | Hoppilliard and Solgadi, 1980 | Vertical value; Trans conformer; LLK |
9.66 ± 0.07 | PE | Leavell, Steichen, et al., 1973 | Vertical value; LLK |
Appearance energy determinations
Ion | AE (eV) | Other Products | Method | Reference | Comment |
---|---|---|---|---|---|
CH3O+ | 11.36 | CH2I | EI | Holmes and Lossing, 1988 | LL |
CH3O+ | 11.36 ± 0.05 | CH2I | EI | Holmes and Lossing, 1984 | LBLHLM |

References

Aldrich Chemical Company Inc., 1990
Aldrich Chemical Company Inc.,
Catalog Handbook of Fine Chemicals, Aldrich Chemical Company, Inc., Milwaukee WI, 1990, 1. [all data]
Baker, Betteridge, et al., 1971
Baker, A.D.; Betteridge, D.; Kemp, N.R.; Kirby, R.E.,
Application of photoelectron spectrometry to pesticide analysis. II.Photoelectron spectra of hydroxy-, and halo-alkanes and halohydrins,
Anal. Chem., 1971, 43, 375. [all data]
Hoppilliard and Solgadi, 1980
Hoppilliard, Y.; Solgadi, D.,
Conformational analysis of 2-haloethanols and 2-methoxyethylhalides in a photoelectron spectrometer,
Tetrahedron, 1980, 36, 377. [all data]
Leavell, Steichen, et al., 1973
Leavell, S.; Steichen, J.; Franklin, J.L.,
Photoelectron spectra of intramolecularly hydrogen bonded compounds,
J. Chem. Phys., 1973, 59, 4343. [all data]
Holmes and Lossing, 1988
Holmes, J.L.; Lossing, F.P.,
Heats of formation and bond dissociation energies in halogen-substituted methyl and ethyl radicals,
J. Am. Chem. Soc., 1988, 110, 7343. [all data]
Holmes and Lossing, 1984
Holmes, J.L.; Lossing, F.P.,
Heats of formation of organic radicals from appearance energies,
Int. J. Mass Spectrom. Ion Processes, 1984, 58, 113. [all data]