1-Propyne, 1-iodo-
- Formula: C3H3I
- Molecular weight: 165.9604
- IUPAC Standard InChIKey: JHUPGXNKUPOSIE-UHFFFAOYSA-N
- CAS Registry Number: 624-66-8
- Chemical structure:
View 3d structure (requires JavaScript / HTML 5) - Permanent link for this species. Use this link for bookmarking this species for future reference.

Gas phase ion energetics data

Data compiled by: Sharon G. Lias, Rhoda D. Levin, and Sherif A. Kafafi
Ionization energy determinations
IE (eV) | Method | Reference |
---|---|---|
9.20 | EI | Holmes and Lossing, 1979 |
9.18 ± 0.02 | PE | Bieri, Heilbronner, et al., 1979 |
Appearance energy determinations
Ion | AE (eV) | Other Products | Method | Reference | Comment |
---|---|---|---|---|---|
C3H3+ | 10.70 | I | EI | Holmes and Lossing, 1979 |

References

Holmes and Lossing, 1979
Holmes, J.L.; Lossing, F.P.,
The reactivity of [C3H3+] ions; a thermochemical study,
Can. J. Chem., 1979, 57, 249. [all data]
Bieri, Heilbronner, et al., 1979
Bieri, G.; Heilbronner, E.; Hornung, V.; Kloster-Jensen, E.; Maier, J.P.; Thommen, F.; von Niessen, W.,
Electronic states of substituted haloacetylene and cyanoacetylene radical cations,
Chem. Phys., 1979, 36, 1. [all data]