1-Propyne, 3-chloro-
- Formula: C3H3Cl
- Molecular weight: 74.509
- IUPAC Standard InChIKey: LJZPPWWHKPGCHS-UHFFFAOYSA-N
- CAS Registry Number: 624-65-7
- Chemical structure:

Phase change data

Data compiled as indicated in comments:
BS - Robert L. Brown and Stephen E. Stein
TRC - Thermodynamics Research Center, NIST Boulder Laboratories, Chris Muzny director
Quantity | Value | Units | Method | Reference | Comment |
---|---|---|---|---|---|
Tboil | 331. | K | N/A | Farchan Laboratories, 1990 | BS |
Tboil | 331.2 | K | N/A | Weast and Grasselli, 1989 | BS |
Tboil | 330. | K | N/A | Hatch and Chiola, 1951 | Uncertainty assigned by TRC = 2. K; TRC |

Reaction thermochemistry data

Data compiled by: John E. Bartmess
Individual Reactions
C3H2Cl- + =
By formula: C3H2Cl- + H+ = C3H3Cl
Quantity | Value | Units | Method | Reference | Comment |
---|---|---|---|---|---|
ΔrH° | 1540. ± 8.8 | kJ/mol | G+TS | Taft and Topsom, 1987 | gas phase; value altered from reference due to change in acidity scale |
Quantity | Value | Units | Method | Reference | Comment |
ΔrG° | 1507. ± 8.4 | kJ/mol | IMRE | Taft and Topsom, 1987 | gas phase; value altered from reference due to change in acidity scale |

Gas phase ion energetics data

Data compiled as indicated in comments:
B - John E. Bartmess
LBLHLM - Sharon G. Lias, John E. Bartmess, Joel F. Liebman, John L. Holmes, Rhoda D. Levin, and W. Gary Mallard
LLK - Sharon G. Lias, Rhoda D. Levin, and Sherif A. Kafafi
Ionization energy determinations
IE (eV) | Method | Reference | Comment |
---|---|---|---|
10.68 | EI | Holmes and Lossing, 1979 | LLK |
10.7 | PE | Bieri, Asbrink, et al., 1982 | Vertical value; LBLHLM |
10.76 | PE | Zverev and Ermolaeva, 1981 | Vertical value; LLK |
10.76 | PE | Andreocci, Bitchev, et al., 1979 | Vertical value; LLK |
10.76 | PE | Botter, Gounelle, et al., 1977 | Vertical value; LLK |
Appearance energy determinations
Ion | AE (eV) | Other Products | Method | Reference | Comment |
---|---|---|---|---|---|
C3H3+ | 11.00 | Cl | EI | Holmes and Lossing, 1979 | LLK |
De-protonation reactions
C3H2Cl- + =
By formula: C3H2Cl- + H+ = C3H3Cl
Quantity | Value | Units | Method | Reference | Comment |
---|---|---|---|---|---|
ΔrH° | 1540. ± 8.8 | kJ/mol | G+TS | Taft and Topsom, 1987 | gas phase; value altered from reference due to change in acidity scale; B |
Quantity | Value | Units | Method | Reference | Comment |
ΔrG° | 1507. ± 8.4 | kJ/mol | IMRE | Taft and Topsom, 1987 | gas phase; value altered from reference due to change in acidity scale; B |

Normal alkane RI, non-polar column, temperature ramp

Column type | Active phase | I | Reference | Comment |
---|---|---|---|---|
Capillary | OV-101 | 542. | Zenkevich, 2005 | 25. m/0.20 mm/0.10 μm, N2/He, 6. K/min; Tstart: 50. C; Tend: 250. C |

Normal alkane RI, non-polar column, custom temperature program

Column type | Active phase | I | Reference | Comment |
---|---|---|---|---|
Capillary | OV-1, SE-30, Methyl silicone, SP-2100, OV-101, DB-1, etc. | 545. | Waggott and Davies, 1984 | Hydrogen; Column length: 50. m; Column diameter: 0.32 mm; Program: not specified |

Vibrational and/or electronic energy levels

Data compiled by: Takehiko Shimanouchi

Symmetry:   Cs     Symmetry Number σ = 1

 Sym.   No   Approximate   Selected Freq.  Infrared   Raman   Comments
 Species   type of mode   Value   Rating   Value  Phase  Value  Phase

a' 1 CH str 3335  C 3335 VS gas 3305 p liq.
a' 2 CH2 s-str 2968  C 2968 M gas 2957 p liq.
a' 3 C≡C str 2147  C 2147 W gas 2130 p liq.
a' 4 CH2 scis 1441  C 1441 M gas 1432 p liq.
a' 5 CH2 wag 1271  C 1271 VS gas 1267 p liq.
a' 6 C-C str 960  C 960 S gas 961 dp liq.
a' 7 CCl str 725  C 725 VS gas 713 p liq.
a' 8 CH bend 650  D 650 S solid solid 650 liq.
a' 9 CCCl deform 451  C 451 gas 452 p liq.
a' 10 CCC deform 186  D 186 dp liq.
a 11 CH2 a-str 3002  C 3002 M gas 2995 dp liq.
a 12 CH2 twist 1179  B 1179 W gas 1174 dp liq.
a 13 CH2 rock 908  D 908 dp liq.
a 14 CH bend 637  D 637 M gas 650 dp liq.
a 15 CCC deform 311  C 311 dp liq.

Source: Shimanouchi, 1972

References

Farchan Laboratories, 1990
Farchan Laboratories,
Research Chemicals Catalog, Farchan Laboratories, Gainesville, FL, 1990, 91. [all data]
Weast and Grasselli, 1989
CRC Handbook of Data on Organic Compounds, 2nd Editon, Weast,R.C and Grasselli, J.G., ed(s)., CRC Press, Inc., Boca Raton, FL, 1989, 1. [all data]
Hatch and Chiola, 1951
Hatch, L.F.; Chiola, V.,
The preparation and properties of 3-chloro-1-propyne and 1-chloro-2-butyne,
J. Am. Chem. Soc., 1951, 73, 360. [all data]
Taft and Topsom, 1987
Taft, R.W.; Topsom, R.D.,
The Nature and Analysis of Substituent Effects,
Prog. Phys. Org. Chem., 1987, 16, 1. [all data]
Holmes and Lossing, 1979
Holmes, J.L.; Lossing, F.P.,
The reactivity of [C3H3+] ions; a thermochemical study,
Can. J. Chem., 1979, 57, 249. [all data]
Bieri, Asbrink, et al., 1982
Bieri, G.; Asbrink, L.; Von Niessen, W.,
30.4-nm He(II) photoelectron spectra of organic molecules,
J. Electron Spectrosc. Relat. Phenom., 1982, 27, 129. [all data]
Zverev and Ermolaeva, 1981
Zverev, V.V.; Ermolaeva, L.V.,
Ionization potentials and intramolecular charge transfer. II. The photoelectron spectrum and electronic structure of trichloromethylbenzene,
Zh. Strukt. Khim., 1981, 22, 22. [all data]
Andreocci, Bitchev, et al., 1979
Andreocci, M.V.; Bitchev, P.; Carusi, P.; Furlani, A.,
Valence shell photoionization spectra of some substituted hydroxy-acetylenes. A tentative correlation with their cyclotrimerization reactions,
J. Electron Spectrosc. Relat. Phenom., 1979, 16, 25. [all data]
Botter, Gounelle, et al., 1977
Botter, R.; Gounelle, Y.; Henry, Y.; Jullien, J.; Menes, F.; Solgadi, D.,
Photoelectron spectra of halogeno-3-propynes (XCH2≡CH) and halogeno- methylcyanides (XCH2C≡N) and comments on the attribution of fluorine IP,
J. Electron Spectrosc. Relat. Phenom., 1977, 10, 393. [all data]
Zenkevich, 2005
Zenkevich, I.G.,
Experimentally measured retention indices., 2005. [all data]
Waggott and Davies, 1984
Waggott, A.; Davies, I.W.,
Identification of organic pollutants using linear temperature programmed retention indices (LTPRIs) - Part II, 1984, retrieved from http://dwi.defra.gov.uk/research/completed-research/reports/dwi0383.pdf. [all data]