Bicyclo[2.2.1]heptane, 2-ethylidene-1,7,7-trimethyl-, (E)-
- Formula: C12H20
- Molecular weight: 164.2872
- IUPAC Standard InChIKey: CXSZQFQLQRAPTP-WEVVVXLNSA-N
- CAS Registry Number: 62413-60-9
- Chemical structure:
View 3d structure (requires JavaScript / HTML 5) - Other names: (2E)-2-Ethylidene-1,7,7-trimethylbicyclo[2.2.1]heptane; 2-Ethylidene-1,7,7-trimethylbicyclo[2.2.1]heptane, (E)-; (E)-2-Ethylidene-1,7,7-trimethylbicyclo[2.2.1]heptane; 2-Ethylidene-1,7,7-trimethylbicyclo[2.2.1]heptane

Gas phase ion energetics data

Data compiled by: Henry M. Rosenstock, Keith Draxl, Bruce W. Steiner, and John T. Herron
Ionization energy determinations
IE (eV) | Method | Reference |
---|---|---|
8.22 ± 0.01 | PI | Demeo and El-Sayed, 1970 |

References

Demeo and El-Sayed, 1970
Demeo, D.A.; El-Sayed, M.A.,
Ionization potential and structure of olefins,
J. Chem. Phys., 1970, 52, 2622. [all data]