Butanoic acid, methyl ester
- Formula: C5H10O2
- Molecular weight: 102.1317
- IUPAC Standard InChIKey: UUIQMZJEGPQKFD-UHFFFAOYSA-N
- CAS Registry Number: 623-42-7
- Chemical structure:
View 3d structure (requires JavaScript / HTML 5) - Other names: Butyric acid, methyl ester; Methyl butanoate; Methyl butyrate; Methyl n-butyrate; n-C3H7COOCH3; n-Butyric acid methyl ester; Methyl n-butanoate; UN 1237; Methyl ester of butanoic acid; NSC 9380

Condensed phase thermochemistry data

Data compiled as indicated in comments:
ALS - Hussein Y. Afeefy, Joel F. Liebman, and Stephen E. Stein
DH - Eugene S. Domalski and Elizabeth D. Hearing
Quantity | Value | Units | Method | Reference | Comment |
---|---|---|---|---|---|
ΔcH°liquid | -693.0 | kcal/mol | Ccb | Schjanberg, 1935 | Corresponding ΔfHºliquid = -118.8 kcal/mol (simple calculation by NIST; no Washburn corrections); ALS |
Constant pressure heat capacity of liquid
Cp,liquid (cal/mol*K) | Temperature (K) | Reference | Comment |
---|---|---|---|
47.361 | 298.15 | Pintos, Bravo, et al., 1988 | DH |
47.99 | 298.15 | Fuchs, 1979 | DH |

Phase change data

Data compiled as indicated in comments:
BS - Robert L. Brown and Stephen E. Stein
TRC - Thermodynamics Research Center, NIST Boulder Laboratories, Chris Muzny director
AC - William E. Acree, Jr., James S. Chickos
ALS - Hussein Y. Afeefy, Joel F. Liebman, and Stephen E. Stein
Quantity | Value | Units | Method | Reference | Comment |
---|---|---|---|---|---|
Tboil | 375. ± 4. | K | AVG | N/A | Average of 22 values; Individual data points |
Quantity | Value | Units | Method | Reference | Comment |
Tc | 554.5 | K | N/A | Young, 1910 | Uncertainty assigned by TRC = 1. K; TRC |
Tc | 554.5 | K | N/A | Young and Thomas, 1893 | Uncertainty assigned by TRC = 1. K; TRC |
Tc | 551.2 | K | N/A | Heilbron, 1891 | Uncertainty assigned by TRC = 3. K; TRC |
Tc | 544.7 | K | N/A | De Heen, 1888 | Uncertainty assigned by TRC = 8. K; TRC |
Quantity | Value | Units | Method | Reference | Comment |
Pc | 34.28 | atm | N/A | Young, 1910 | Uncertainty assigned by TRC = 0.8000 atm; TRC |
Pc | 34.250 | atm | N/A | Young and Thomas, 1893 | Uncertainty assigned by TRC = 0.39 atm; TRC |
Pc | 36.02 | atm | N/A | Heilbron, 1891 | Uncertainty assigned by TRC = 2.0000 atm; TRC |
Quantity | Value | Units | Method | Reference | Comment |
ρc | 2.939 | mol/l | N/A | Young, 1910 | Uncertainty assigned by TRC = 0.098 mol/l; TRC |
ρc | 2.940 | mol/l | N/A | Young and Thomas, 1893 | Uncertainty assigned by TRC = 0.04 mol/l; TRC |
ρc | 2.85 | mol/l | N/A | Heilbron, 1891 | Uncertainty assigned by TRC = 0.098 mol/l; TRC |
Quantity | Value | Units | Method | Reference | Comment |
ΔvapH° | 9.5 ± 0.3 | kcal/mol | AVG | N/A | Average of 11 values; Individual data points |
Enthalpy of vaporization
ΔvapH (kcal/mol) | Temperature (K) | Method | Reference | Comment |
---|---|---|---|---|
8.076 | 375.9 | N/A | Majer and Svoboda, 1985 | |
8.82 | 350. | N/A | van Genderen, van Miltenburg, et al., 2002 | AC |
9.82 ± 0.05 | 284. | N/A | van Genderen, van Miltenburg, et al., 2002 | AC |
9.18 | 332. | N/A | Swiatek and Malanowski, 2002 | Based on data from 317. to 360. K.; AC |
8.70 | 364. | N/A | Ortega, Susial, et al., 1990 | Based on data from 349. to 384. K.; AC |
8.17 | 390. | A | Stephenson and Malanowski, 1987 | Based on data from 375. to 545. K.; AC |
10.2 | 261. | A | Stephenson and Malanowski, 1987 | Based on data from 246. to 375. K. See also Stull, 1947.; AC |
Antoine Equation Parameters
log10(P) = A − (B / (T + C))
P = vapor pressure (atm)
T = temperature (K)
View plot Requires a JavaScript / HTML 5 canvas capable browser.
Temperature (K) | A | B | C | Reference | Comment |
---|---|---|---|---|---|
375.5 to 545. | 4.71515 | 1758.314 | -2.421 | Stull, 1947 | Coefficents calculated by NIST from author's data. |
246.4 to 375.5 | 4.57928 | 1528.058 | -41.606 | Stull, 1947 | Coefficents calculated by NIST from author's data. |

Reaction thermochemistry data

Data compiled by: Hussein Y. Afeefy, Joel F. Liebman, and Stephen E. Stein
Individual Reactions
By formula: C7H16O3 + H2O = C5H10O2 + 2CH4O
Quantity | Value | Units | Method | Reference | Comment |
---|---|---|---|---|---|
ΔrH° | -6.272 ± 0.014 | kcal/mol | Cm | Wiberg, Martin, et al., 1985 | liquid phase; solvent: Aqueous dioxane |
ΔrH° | -6.315 ± 0.014 | kcal/mol | Cm | Wiberg, 1980 | liquid phase; solvent: Water; Hydrolysis |

Henry's Law data

Data compiled by: Rolf Sander
Henry's Law constant (water solution)
kH(T) = k°H exp(d(ln(kH))/d(1/T) ((1/T) - 1/(298.15 K)))
k°H = Henry's law constant for solubility in water at 298.15 K (mol/(kg*bar))
d(ln(kH))/d(1/T) = Temperature dependence constant (K)
k°H (mol/(kg*bar)) | d(ln(kH))/d(1/T) (K) | Method | Reference |
---|---|---|---|
4.8 | M | Buttery, Ling, et al., 1969 |

Gas phase ion energetics data

Data evaluated as indicated in comments:
HL - Edward P. Hunter and Sharon G. Lias
Data compiled as indicated in comments:
LLK - Sharon G. Lias, Rhoda D. Levin, and Sherif A. Kafafi
RDSH - Henry M. Rosenstock, Keith Draxl, Bruce W. Steiner, and John T. Herron
Quantity | Value | Units | Method | Reference | Comment |
---|---|---|---|---|---|
Proton affinity (review) | 199.9 | kcal/mol | N/A | Hunter and Lias, 1998 | HL |
Quantity | Value | Units | Method | Reference | Comment |
Gas basicity | 192.5 | kcal/mol | N/A | Hunter and Lias, 1998 | HL |
Ionization energy determinations
IE (eV) | Method | Reference | Comment |
---|---|---|---|
10.07 ± 0.03 | PI | Watanabe, Nakayama, et al., 1962 | RDSH |
10.15 | PE | Benoit and Harrison, 1977 | Vertical value; LLK |
Appearance energy determinations
Ion | AE (eV) | Other Products | Method | Reference | Comment |
---|---|---|---|---|---|
C3H6O2+ | 10.18 | C2H4 | EI | Holmes and Lossing, 1980 | LLK |
C3H6O2+ | 10.17 ± 0.05 | ? | EI | Holmes and Lossing, 1979 | LLK |
C3H6O2+ | 11.0 ± 0.2 | C2H4 | EI | Howe, Williams, et al., 1969 | RDSH |
C4H7O+ | 11.2 ± 0.2 | CH3O | EI | Howe, Williams, et al., 1969 | RDSH |

Kovats' RI, non-polar column, temperature ramp

Data compiled by: NIST Mass Spectrometry Data Center, William E. Wallace, director

Column type CapillaryCapillaryCapillaryCapillaryCapillary
Active phase DB-1DB-1DB-1DB-1BP-1
Column length (m) 60.60.60.60.50.
Carrier gas HeHeHeHeHe
Substrate
Column diameter (mm) 0.320.320.320.320.23
Phase thickness (μm) 0.250.250.250.25
Tstart (C) 30.30.30.30.30.
Tend (C) 210.210.210.210.200.
Heat rate (K/min) 2.2.2.2.2.
Initial hold (min) 4.4.4.4.2.
Final hold (min)
I 705.708.705.708.705.
ReferenceTakeoka, Buttery, et al., 1992Takeoka, Buttery, et al., 1992Takeoka, Flath, et al., 1990Takeoka, Flath, et al., 1990Bartley and Schwede, 1989
Comment MSDC-RI MSDC-RI MSDC-RI MSDC-RI MSDC-RI
Column type Capillary
Active phase OV-101
Column length (m) 25.
Carrier gas He
Substrate
Column diameter (mm) 0.31
Phase thickness (μm)
Tstart (C) 60.
Tend (C) 200.
Heat rate (K/min) 2.
Initial hold (min)
Final hold (min)
I 710.
ReferenceMorales and Duque, 1987
Comment MSDC-RI

Kovats' RI, non-polar column, custom temperature program

Data compiled by: NIST Mass Spectrometry Data Center, William E. Wallace, director

Column type Capillary
Active phase SE-30
Column length (m)
Carrier gas
Substrate
Column diameter (mm)
Phase thickness (μm)
Program not specified
I 702.
ReferenceChretien and Dubois, 1978
Comment MSDC-RI

Kovats' RI, polar column, isothermal

Data compiled by: NIST Mass Spectrometry Data Center, William E. Wallace, director

Column type PackedPacked
Active phase Carbowax 20MCarbowax 20M
Column length (m) 3.2.
Carrier gas
Substrate Chromosorb WAW (60-80 mesh)Chromosorb W
Column diameter (mm)
Phase thickness (μm)
Temperature (C) 100.100.
I 982.997.
ReferenceChastrette, Heintz, et al., 1974Zarazir, Chovin, et al., 1970
Comment MSDC-RI MSDC-RI

References

Schjanberg, 1935
Schjanberg, E.,
Die Verbrennungswarmen und die Refraktionsdaten einiger chlorsubstituierter Fettsauren und Ester.,
Z. Phys. Chem. Abt. A, 1935, 172, 197-233. [all data]
Pintos, Bravo, et al., 1988
Pintos, M.; Bravo, R.; Baluja, M.C.; Paz Andrade, M.I.; Roux-Desgranges, G.; Grolier, J.-P.E.,
Can. J. Chem., 1988, 1179. [all data]
Fuchs, 1979
Fuchs, R.,
Heat capacities of some liquid aliphatic, alicyclic, and aromatic esters at 298.15 K,
J. Chem. Thermodyn., 1979, 11, 959-961. [all data]
Young, 1910
Young, S.,
The Internal Heat of Vaporization constants of thirty pure substances,
Sci. Proc. R. Dublin Soc., 1910, 12, 374. [all data]
Young and Thomas, 1893
Young, S.; Thomas, G.L.,
The vapour pressures, molecular volumes, and critical constants of ten of the lower esters,
J. Chem. Soc., 1893, 63, 1191. [all data]
Heilbron, 1891
Heilbron, E.,
Summary of the Critical Data Up To Now on Liquids.,
Z. Phys. Chem., Stoechiom. Verwandtschaftsl., 1891, 1, 601-13. [all data]
De Heen, 1888
De Heen, P.,
Research on Physics and Theory of Liquids, Experimental Part Paris, 1888. [all data]
Majer and Svoboda, 1985
Majer, V.; Svoboda, V.,
Enthalpies of Vaporization of Organic Compounds: A Critical Review and Data Compilation, Blackwell Scientific Publications, Oxford, 1985, 300. [all data]
van Genderen, van Miltenburg, et al., 2002
van Genderen, Aad C.G.; van Miltenburg, J. Cees; Blok, Jacobus G.; van Bommel, Mark J.; van Ekeren, Paul J.; van den Berg, Gerrit J.K.; Oonk, Harry A.J.,
Liquid--vapour equilibria of the methyl esters of alkanoic acids: vapour pressures as a function of temperature and standard thermodynamic function changes,
Fluid Phase Equilibria, 2002, 202, 1, 109-120, https://doi.org/10.1016/S0378-3812(02)00097-3
. [all data]
Swiatek and Malanowski, 2002
Swiatek, Barbara E.; Malanowski, Stanislaw K.,
Vapor-Liquid Equilibrium in m -Xylene + Cyclohexanol at 19.99 and 94.93 kPa,
J. Chem. Eng. Data, 2002, 47, 3, 478-481, https://doi.org/10.1021/je010246z
. [all data]
Ortega, Susial, et al., 1990
Ortega, Juan; Susial, Pedro; De Alfonso, Casiano,
Isobaric vapor-liquid equilibrium of methyl butanoate with ethanol and 1-propanol binary systems,
J. Chem. Eng. Data, 1990, 35, 2, 216-219, https://doi.org/10.1021/je00060a037
. [all data]
Stephenson and Malanowski, 1987
Stephenson, Richard M.; Malanowski, Stanislaw,
Handbook of the Thermodynamics of Organic Compounds, 1987, https://doi.org/10.1007/978-94-009-3173-2
. [all data]
Stull, 1947
Stull, Daniel R.,
Vapor Pressure of Pure Substances. Organic and Inorganic Compounds,
Ind. Eng. Chem., 1947, 39, 4, 517-540, https://doi.org/10.1021/ie50448a022
. [all data]
Wiberg, Martin, et al., 1985
Wiberg, K.B.; Martin, E.J.; Squires, R.R.,
Thermochemical studies of carbonyl compounds. 3. Enthalpies of hydrolysis of ortho esters,
J. Org. Chem., 1985, 50, 4717-4720. [all data]
Wiberg, 1980
Wiberg, K.B.,
Energies of organic compounds,
Rept. DOE-E(11-1)4060 Prepared for US Dept. of Energy by Yale Univ., New Haven, CT. Avail. NTIS, 1980, 1-24. [all data]
Buttery, Ling, et al., 1969
Buttery, R.G.; Ling, L.C.; Guadagni, D.G.,
Volatilities Aldehydes, Ketones, and Esters in Dilute Water Solution,
J. Agric. Food Chem., 1969, 17, 385-389. [all data]
Hunter and Lias, 1998
Hunter, E.P.; Lias, S.G.,
Evaluated Gas Phase Basicities and Proton Affinities of Molecules: An Update,
J. Phys. Chem. Ref. Data, 1998, 27, 3, 413-656, https://doi.org/10.1063/1.556018
. [all data]
Watanabe, Nakayama, et al., 1962
Watanabe, K.; Nakayama, T.; Mottl, J.,
Ionization potentials of some molecules,
J. Quant. Spectry. Radiative Transfer, 1962, 2, 369. [all data]
Benoit and Harrison, 1977
Benoit, F.M.; Harrison, A.G.,
Predictive value of proton affinity. Ionization energy correlations involving oxygenated molecules,
J. Am. Chem. Soc., 1977, 99, 3980. [all data]
Holmes and Lossing, 1980
Holmes, J.L.; Lossing, F.P.,
Gas-phase heats of formation of keto and enol ions of carbonyl compounds.,
J. Am. Chem. Soc., 1980, 102, 1591. [all data]
Holmes and Lossing, 1979
Holmes, J.L.; Lossing, F.P.,
Keto and enol forms of methyl acetate molecular ions, their stability and interconvertibility prior to fragmentation in the gas phase,
Org. Mass Spectrom., 1979, 14, 512. [all data]
Howe, Williams, et al., 1969
Howe, I.; Williams, D.H.; Kingston, D.G.I.; Tannenbaum, H.P.,
Substituent effects in the mass spectra of some - and -substituted methyl butyrates,
J. Chem. Soc. B, 1969, 439. [all data]