3-Hexanol
- Formula: C6H14O
- Molecular weight: 102.1748
- IUPAC Standard InChIKey: ZOCHHNOQQHDWHG-UHFFFAOYSA-N
- CAS Registry Number: 623-37-0
- Chemical structure:
View 3d structure (requires JavaScript / HTML 5) - Other names: Hexan-3-ol; C2H5CH(OH)C3H7; Ethylpropylcarbinol; Hexanol-(3)

Gas phase thermochemistry data

Data compiled by: Donald R. Burgess, Jr.
Quantity | Value | Units | Method | Reference | Comment |
---|---|---|---|---|---|
ΔfH°gas | -332.8 ± 2.2 | kJ/mol | N/A | Wiberg, Wasserman, et al., 1984 | Value computed using ΔfHliquid° value of -390.3±0.88 kj/mol from Wiberg, Wasserman, et al., 1984 and ΔvapH° value of 57.5±2 kj/mol from sec-alkanol correlation. |

Condensed phase thermochemistry data

Data compiled as indicated in comments:
ALS - Hussein Y. Afeefy, Joel F. Liebman, and Stephen E. Stein
DH - Eugene S. Domalski and Elizabeth D. Hearing
Quantity | Value | Units | Method | Reference | Comment |
---|---|---|---|---|---|
ΔfH°liquid | -390.3 ± 0.88 | kJ/mol | Cm | Wiberg, Wasserman, et al., 1984 | Heat of hydration, see Wiberg and Wasserman, 1981; ALS |
Constant pressure heat capacity of liquid
Cp,liquid (J/mol*K) | Temperature (K) | Reference | Comment |
---|---|---|---|
269.27 | 298.15 | Tanaka, Luo, et al., 1988 | DH |
286.2 | 298. | Conti, Gianni, et al., 1976 | DH |

Phase change data

Data compiled as indicated in comments:
BS - Robert L. Brown and Stephen E. Stein
TRC - Thermodynamics Research Center, NIST Boulder Laboratories, Chris Muzny director
AC - William E. Acree, Jr., James S. Chickos
Quantity | Value | Units | Method | Reference | Comment |
---|---|---|---|---|---|
Tboil | 407. ± 2. | K | AVG | N/A | Average of 22 out of 23 values; Individual data points |
Quantity | Value | Units | Method | Reference | Comment |
Tc | 582.4 ± 0.5 | K | N/A | Gude and Teja, 1995 | |
Tc | 582.2 | K | N/A | Quadri, Khilar, et al., 1991 | Uncertainty assigned by TRC = 0.8 K; TRC |
Tc | 582.58 | K | N/A | Teja, Lee, et al., 1989 | TRC |
Tc | 582.48 | K | N/A | Anselme and Teja, 1988 | Uncertainty assigned by TRC = 0.3 K; TRC |
Quantity | Value | Units | Method | Reference | Comment |
Pc | 33.6 ± 0.2 | bar | N/A | Gude and Teja, 1995 | |
Pc | 33.60 | bar | N/A | Quadri, Khilar, et al., 1991 | Uncertainty assigned by TRC = 0.50 bar; TRC |
Quantity | Value | Units | Method | Reference | Comment |
Vc | 0.383 | l/mol | N/A | Gude and Teja, 1995 | |
Quantity | Value | Units | Method | Reference | Comment |
ρc | 2.61 ± 0.02 | mol/l | N/A | Gude and Teja, 1995 | |
ρc | 2.61 | mol/l | N/A | Anselme and Teja, 1988 | Uncertainty assigned by TRC = 0.06 mol/l; TRC |
Quantity | Value | Units | Method | Reference | Comment |
ΔvapH° | 58.6 ± 0.4 | kJ/mol | GS | Kulikov, Verevkin, et al., 2001 | Based on data from 278. to 311. K.; AC |
Enthalpy of vaporization
ΔvapH (kJ/mol) | Temperature (K) | Method | Reference | Comment |
---|---|---|---|---|
46.1 | 369. | A | Stephenson and Malanowski, 1987 | Based on data from 354. to 410. K.; AC |
57.5 | 295. | A | Stephenson and Malanowski, 1987 | Based on data from 280. to 320. K.; AC |
51.5 | 348. | N/A | Sachek, Markovnik, et al., 1984 | Based on data from 333. to 409. K.; AC |
57.4 | 295. | N/A | Cabani, Conti, et al., 1975 | Based on data from 280. to 316. K.; AC |
46.4 | 353. | I | Hovorka, Lankelma, et al., 1938 | Based on data from 298. to 408. K.; AC |
Antoine Equation Parameters
log10(P) = A − (B / (T + C))
P = vapor pressure (bar)
T = temperature (K)
View plot Requires a JavaScript / HTML 5 canvas capable browser.
Temperature (K) | A | B | C | Reference | Comment |
---|---|---|---|---|---|
298. to 411. | 6.1625 | 2662.265 | 23.469 | Hovorka, Lankelma, et al., 1938 | Coefficents calculated by NIST from author's data. |

Reaction thermochemistry data

Data compiled as indicated in comments:
B - John E. Bartmess
ALS - Hussein Y. Afeefy, Joel F. Liebman, and Stephen E. Stein
Individual Reactions
C6H13O- + =
By formula: C6H13O- + H+ = C6H14O
Quantity | Value | Units | Method | Reference | Comment |
---|---|---|---|---|---|
ΔrH° | 1556. ± 8.4 | kJ/mol | CIDC | Haas and Harrison, 1993 | gas phase; Both metastable and 50 eV collision energy.; B |
Quantity | Value | Units | Method | Reference | Comment |
ΔrG° | 1529. ± 8.8 | kJ/mol | H-TS | Haas and Harrison, 1993 | gas phase; Both metastable and 50 eV collision energy.; B |
By formula: C6H14O = C6H12 + H2O
Quantity | Value | Units | Method | Reference | Comment |
---|---|---|---|---|---|
ΔrH° | 32.1 ± 0.3 | kJ/mol | Cm | Wiberg, Wasserman, et al., 1984 | liquid phase; Heat of hydration, see Wiberg and Wasserman, 1981; ALS |
By formula: C4F6O3 + C6H14O = C2HF3O2 + C8H13F3O2
Quantity | Value | Units | Method | Reference | Comment |
---|---|---|---|---|---|
ΔrH° | -92.68 ± 0.04 | kJ/mol | Cm | Wiberg and Wasserman, 1981 | liquid phase; ALS |

Gas phase ion energetics data

Data compiled as indicated in comments:
B - John E. Bartmess
LLK - Sharon G. Lias, Rhoda D. Levin, and Sherif A. Kafafi
Ionization energy determinations
IE (eV) | Method | Reference | Comment |
---|---|---|---|
9.63 ± 0.03 | PE | Ashmore and Burgess, 1977 | LLK |
10.15 | PE | Ashmore and Burgess, 1977 | Vertical value; LLK |
De-protonation reactions
C6H13O- + =
By formula: C6H13O- + H+ = C6H14O
Quantity | Value | Units | Method | Reference | Comment |
---|---|---|---|---|---|
ΔrH° | 1556. ± 8.4 | kJ/mol | CIDC | Haas and Harrison, 1993 | gas phase; Both metastable and 50 eV collision energy.; B |
Quantity | Value | Units | Method | Reference | Comment |
ΔrG° | 1529. ± 8.8 | kJ/mol | H-TS | Haas and Harrison, 1993 | gas phase; Both metastable and 50 eV collision energy.; B |

Kovats' RI, non-polar column, isothermal

Column type | Active phase | Temperature (C) | I | Reference | Comment |
---|---|---|---|---|---|
Capillary | SE-30 | 100. | 780.2 | Tudor, 1997 | 40. m/0.35 mm/0.35 μm |
Capillary | OV-101 | 150. | 774.8 | Cha and Lee, 1994 | Column length: 20. m; Column diameter: 0.5 mm |
Capillary | OV-101 | 180. | 778.5 | Cha and Lee, 1994 | Column length: 20. m; Column diameter: 0.5 mm |
Capillary | OV-101 | 80. | 782.6 | Boneva, 1987 | N2; Column length: 100. m; Column diameter: 0.27 mm |
Capillary | OV-101 | 90. | 783.8 | Boneva, 1987 | N2; Column length: 100. m; Column diameter: 0.27 mm |
Packed | Apiezon L | 120. | 769. | Bogoslovsky, Anvaer, et al., 1978 | Celite 545 |
Packed | Apiezon L | 160. | 779. | Bogoslovsky, Anvaer, et al., 1978 | Celite 545 |
Packed | SE-30 | 100. | 785. | Pías and Gascó, 1975 | Ar, Chromosorb W AW DMCS HP (80-100 mesh); Column length: 1. m |
Packed | SE-30 | 120. | 783. | Pías and Gascó, 1975 | Ar, Chromosorb W AW DMCS HP (80-100 mesh); Column length: 1. m |
Packed | SE-30 | 140. | 781. | Pías and Gascó, 1975 | Ar, Chromosorb W AW DMCS HP (80-100 mesh); Column length: 1. m |
Packed | Squalane | 50. | 761. | Mira and Sanchez, 1970 | Chromosorb G |

Kovats' RI, non-polar column, temperature ramp

Column type | Active phase | I | Reference | Comment |
---|---|---|---|---|
Capillary | DB-1 | 784. | Takeoka, Flath, et al., 1990 | 60. m/0.32 mm/0.25 μm, He, 30. C @ 4. min, 2. K/min; Tend: 210. C |
Capillary | DB-1 | 784. | Takeoka, Flath, et al., 1990 | 60. m/0.32 mm/0.25 μm, He, 30. C @ 4. min, 2. K/min; Tend: 210. C |
Capillary | OV-101 | 783. | Ohnishi and Shibamoto, 1984 | 2. K/min; Column length: 50. m; Column diameter: 0.23 mm; Tstart: 80. C; Tend: 200. C |
Capillary | OV-101 | 785. | Ohnishi and Shibamoto, 1984 | 2. K/min; Column length: 50. m; Column diameter: 0.23 mm; Tstart: 80. C; Tend: 200. C |

Kovats' RI, polar column, isothermal

Column type | Active phase | Temperature (C) | I | Reference | Comment |
---|---|---|---|---|---|
Capillary | Carbowax 20M | 80. | 1206. | Boneva, 1987 | N2; Column length: 50. m; Column diameter: 0.23 mm |
Capillary | Carbowax 20M | 90. | 1207. | Boneva, 1987 | N2; Column length: 50. m; Column diameter: 0.23 mm |
Packed | Polyethylene Glycol 4000 | 100. | 1189. | Bonastre and Grenier, 1968 | Chromosorb P; Column length: 6. m |
Packed | Polyethylene Glycol 4000 | 120. | 1184. | Bonastre and Grenier, 1968 | Chromosorb P; Column length: 6. m |
Packed | Polyethylene Glycol 4000 | 140. | 1180. | Bonastre and Grenier, 1968 | Chromosorb P; Column length: 6. m |
Packed | Polyethylene Glycol 4000 | 80. | 1193. | Bonastre and Grenier, 1968 | Chromosorb P; Column length: 6. m |

Kovats' RI, polar column, custom temperature program

Column type | Active phase | I | Reference | Comment |
---|---|---|---|---|
Capillary | Carbowax 20M | 1197. | Garruti, Franco, et al., 2001 | H2; Column length: 30. m; Column diameter: 0.25 mm; Program: 50 0C (8 min) 4 K/min -> 110 0C 16 K/min -> 200 0C |

Van Den Dool and Kratz RI, non-polar column, custom temperature program

Column type | Active phase | I | Reference | Comment |
---|---|---|---|---|
Capillary | VF-5MS | 801.3 | Tret'yakov, 2007 | 30. m/0.25 mm/0.25 μm, He; Program: Multi-step temperature program; T(initial)=60C; T(final)=270C |
Capillary | HP-5 | 802. | Boué, Shih, et al., 2003 | 50. m/0.2 mm/0.5 μm, He; Program: 40C(3min) => 10C/min => 60C =3C/min => 150C => 20C/min => 250C (5min) |
Capillary | DB-5 | 797. | Beaulieu and Grimm, 2001 | 30. m/0.25 mm/0.25 μm, He; Program: 50C (1min) => 5C/min => 100C => 10C/min => 250C (9min) |

Van Den Dool and Kratz RI, polar column, temperature ramp

Column type | Active phase | I | Reference | Comment |
---|---|---|---|---|
Capillary | Supelcowax-10 | 1222. | Matiella and Hsieh, 1990 | 60. m/0.25 mm/0.25 μm, 40. C @ 5. min, 2. K/min, 175. C @ 20. min |
Capillary | Supelcowax-10 | 1198. | Tanchotikul and Hsieh, 1989 | 60. m/0.25 mm/0.25 μm, 40. C @ 5. min, 2. K/min, 175. C @ 20. min |
Capillary | Supelcowax-10 | 1211. | Tanchotikul and Hsieh, 1989 | 60. m/0.25 mm/0.25 μm, 40. C @ 5. min, 2. K/min, 175. C @ 20. min |

Van Den Dool and Kratz RI, polar column, custom temperature program

Column type | Active phase | I | Reference | Comment |
---|---|---|---|---|
Capillary | Supelcowax-10 | 1207. | Bianchi, Careri, et al., 2007 | 30. m/0.25 mm/0.25 μm, He; Program: 35C(8min) => 4C/min => 60C => 6C/min => 160C => 20C/min => 200C(1min) |
Capillary | Supelcowax-10 | 1204. | Bianchi, Careri, et al., 2007 | 30. m/0.25 mm/0.25 μm, He; Program: 35C(8min) => 4C/min => 60C => 6C/min => 160C => 20C/min => 200C(1min) |
Capillary | DB-Wax | 1211. | Pennarun, Prost, et al., 2003 | 30. m/0.32 mm/0.5 μm, He; Program: 50C => 6C/min => 70C => 4C/min => 150C => 10C/min => 250C |
Capillary | DB-Wax | 1211. | Pennarun, Prost, et al., 2002 | 30. m/0.32 mm/0.5 μm, He; Program: 50C => 6C/min => 70C => 4C/min => 150C => 10C/min => 250C |

Normal alkane RI, non-polar column, isothermal

Column type | Active phase | Temperature (C) | I | Reference | Comment |
---|---|---|---|---|---|
Packed | SE-30 | 100. | 785. | Zhou and Wu, 2007 | Column length: 1. m |

Normal alkane RI, non-polar column, temperature ramp

Column type | Active phase | I | Reference | Comment |
---|---|---|---|---|
Capillary | HP-5 MS | 797. | Radulovic, Dordevic, et al., 2010 | 30. m/0.25 mm/0.25 μm, Helium, 5. K/min, 290. C @ 10. min; Tstart: 70. C |
Capillary | DB-5 | 811. | Joffraud, Leroi, et al., 2001 | 60. m/0.32 mm/1. μm, He, 40. C @ 5. min, 3. K/min; Tend: 200. C |
Capillary | HP-5 | 806. | Boylston and Viniyard, 1998 | 50. m/0.32 mm/0.52 μm, 35. C @ 15. min, 2. K/min, 250. C @ 45. min |
Capillary | DB-1 | 776. | Binder, Benson, et al., 1990 | 4. K/min, 230. C @ 10. min; Column length: 60. m; Column diameter: 0.32 mm; Tstart: 50. C |
Capillary | DB-1 | 776. | Binder and Flath, 1989 | 50. C @ 0.1 min, 4. K/min, 250. C @ 5. min; Column length: 60. m; Column diameter: 0.32 mm |
Capillary | DB-1 | 784. | Takeoka and Butter, 1989 | He, 30. C @ 4. min, 2. K/min; Column length: 60. m; Column diameter: 0.32 mm; Tend: 210. C |
Capillary | DB-1 | 784. | Takeoka and Butter, 1989 | He, 30. C @ 4. min, 2. K/min; Column length: 60. m; Column diameter: 0.32 mm; Tend: 210. C |
Capillary | DB-1 | 791. | Habu, Flath, et al., 1985 | 3. K/min; Column length: 50. m; Column diameter: 0.32 mm; Tstart: 0. C; Tend: 250. C |
Capillary | OV-101 | 788. | del Rosario, de Lumen, et al., 1984 | He, 0. C @ 1. min, 3. K/min; Column length: 50. m; Column diameter: 0.31 mm; Tend: 225. C |

Normal alkane RI, non-polar column, custom temperature program

Column type | Active phase | I | Reference | Comment |
---|---|---|---|---|
Capillary | Methyl Silicone | 780. | Feng and Mu, 2007 | Program: not specified |
Capillary | Methyl Silicone | 785. | Kou, Zhang, et al., 2006 | Program: not specified |
Capillary | Methyl Silicone | 785. | Fu and Wang, 2004 | Program: not specified |
Capillary | SPB-5 | 793. | Begnaud, Pérès, et al., 2003 | 60. m/0.32 mm/1. μm; Program: not specified |
Capillary | Polydimethyl siloxane | 780. | Junkes, Castanho, et al., 2003 | Program: not specified |
Capillary | Polydimethyl siloxane | 762. | Spanier, Shahidi, et al., 2001 | Program: not specified |
Capillary | Methyl Silicone | 780. | Estrada and Gutierrez, 1999 | Program: not specified |
Capillary | CP Sil 5 CB | 769. | Guyot, Bouseta, et al., 1998 | 50. m/0.32 mm/1.2 μm, He; Program: 30C => 55C/min => 85C => 1C/min => 145C => 3C/min => 250C |
Capillary | Polydimethyl siloxanes | 790. | Zenkevich, 1998 | Program: not specified |
Capillary | DB-1 | 776. | Binder and Flath, 1989 | Column length: 60. m; Column diameter: 0.32 mm; Program: not specified |
Capillary | CP Sil 8 CB | 795. | Weller and Wolf, 1989 | 40. m/0.25 mm/0.25 μm, He; Program: 30 0C (1 min) 15 0C/min -> 45 0C 3 0C/min -> 120 0C |
Capillary | DB-1 | 815. | MacLeod and Snyder, 1988 | Program: not specified |

Normal alkane RI, polar column, temperature ramp

Column type | Active phase | I | Reference | Comment |
---|---|---|---|---|
Capillary | DB-Wax | 1190. | Karlsson, Birgersson, et al., 2009 | 30. m/0.25 mm/0.25 μm, Hydrogen, 30. C @ 5. min, 8. K/min, 230. C @ 10. min |
Capillary | DB-Wax | 1192. | Binder, Benson, et al., 1990 | 4. K/min, 230. C @ 10. min; Column length: 60. m; Column diameter: 0.32 mm; Tstart: 50. C |
Capillary | DB-Wax | 1189. | Binder and Flath, 1989 | 50. C @ 0.1 min, 4. K/min, 250. C @ 5. min; Column length: 60. m; Column diameter: 0.32 mm |
Capillary | Carbowax 20M | 1200. | Seifert and King, 1982 | He, 50. C @ 10. min, 1. K/min, 170. C @ 60. min; Column length: 150. m; Column diameter: 0.64 mm |

Normal alkane RI, polar column, custom temperature program

Column type | Active phase | I | Reference | Comment |
---|---|---|---|---|
Capillary | Innowax FSC | 1202. | Bardakci, Demirci, et al., 2012 | 60. m/0.25 mm/0.25 μm, Helium; Program: 60 0C (10 min) 4 0C/min -> 220 0C 1 0C/min -> 240 0C |
Capillary | Supelcowax-10 | 1194. | Berard, Bianchi, et al., 2007 | 30. m/0.25 mm/0.25 μm, He; Program: 35C(8min) => 6C/min => 60C => 4C/min => 160C => 20C/min => 200C(1min) |
Capillary | Supelcowax-10 | 1207. | Berard, Bianchi, et al., 2007 | 30. m/0.25 mm/0.25 μm, He; Program: 35C(8min) => 6C/min => 60C => 4C/min => 160C => 20C/min => 200C(1min) |
Capillary | HP-Innowax | 1185. | Narain, Galvao, et al., 2007 | 30. m/0.25 mm/0.25 μm, Helium; Program: 30 0C (5 min) 5 0C/min -> 100 0C (5 min) 1 0C/min -> 130 0C 10 0C/min -> 195 0C (45 min) |
Capillary | PEG-20M | 1197. | Garruti, Franco, et al., 2003 | 30. m/0.25 mm/0.25 μm; Program: 50C(8min) => 4C/min => 110C => 16C/min => 200C |
Capillary | DB-Wax | 1190. | Caldentey, Daria Fumi, et al., 1998 | 30. m/0.25 mm/0.25 μm, He; Program: 25C(8min) => 4C/min => 60C => 6C/min => 160C => 20C/min => 200C |
Capillary | DB-Wax | 1192. | Binder and Flath, 1989 | Column length: 60. m; Column diameter: 0.32 mm; Program: not specified |

Henry's Law data

Data compiled by: Rolf Sander
Henry's Law constant (water solution)
kH(T) = k°H exp(d(ln(kH))/d(1/T) ((1/T) - 1/(298.15 K)))
k°H = Henry's law constant for solubility in water at 298.15 K (mol/(kg*bar))
d(ln(kH))/d(1/T) = Temperature dependence constant (K)
k°H (mol/(kg*bar)) | d(ln(kH))/d(1/T) (K) | Method | Reference |
---|---|---|---|
20. | V | N/A |

References

Wiberg, Wasserman, et al., 1984
Wiberg, K.B.; Wasserman, D.J.; Martin, E.,
Enthalpies of hydration of alkenes. 2. The n-heptenes and n-pentenes,
J. Phys. Chem., 1984, 88, 3684-3688. [all data]
Wiberg and Wasserman, 1981
Wiberg, K.B.; Wasserman, D.J.,
Enthalpies of hydration of alkenes. 1. The n-hexenes,
J. Am. Chem. Soc., 1981, 103, 6563-6566. [all data]
Tanaka, Luo, et al., 1988
Tanaka, R.; Luo, B.; Benson, G.C.; Lu, B.C.-Y.,
Excess isobaric heat capacities and excess volumes of some hexanol + n-heptane mixtures,
Thermochim. Acta, 1988, 127, 15-23. [all data]
Conti, Gianni, et al., 1976
Conti, G.; Gianni, P.; Matteoli, E.; Mengheri, M.,
Capacita termiche molari di alcuni composti organici mono- e bifunzionali nel liquido puro e in soluzione acquosa a 25C,
Chim. Ind. (Milan), 1976, 58, 225. [all data]
Gude and Teja, 1995
Gude, M.; Teja, A.S.,
Vapor-Liquid Critical Properties of Elements and Compounds. 4. Aliphatic Alkanols,
J. Chem. Eng. Data, 1995, 40, 1025-1036. [all data]
Quadri, Khilar, et al., 1991
Quadri, S.K.; Khilar, K.C.; Kudchadker, A.P.; Patni, M.J.,
Measurement of the critical temperatures and critical pressures of some thermally stable or mildly unstable alkanols,
J. Chem. Thermodyn., 1991, 23, 67-76. [all data]
Teja, Lee, et al., 1989
Teja, A.S.; Lee, R.J.; Rosenthal, D.J.; Anselme, M.J.,
Correlation of the Critical Properties of Alkanes and Alkanols
in 5th IUPAC Conference on Alkanes and AlkanolsGradisca, 1989. [all data]
Anselme and Teja, 1988
Anselme, M.J.; Teja, A.S.,
Critical Temperatures and Densities of Isomeric Alkanols with Six to Ten Carbon Atoms,
Fluid Phase Equilib., 1988, 40, 127-34. [all data]
Kulikov, Verevkin, et al., 2001
Kulikov, Dmitry; Verevkin, Sergey P.; Heintz, Andreas,
Determination of Vapor Pressures and Vaporization Enthalpies of the Aliphatic Branched C 5 and C 6 Alcohols,
J. Chem. Eng. Data, 2001, 46, 6, 1593-1600, https://doi.org/10.1021/je010187p
. [all data]
Stephenson and Malanowski, 1987
Stephenson, Richard M.; Malanowski, Stanislaw,
Handbook of the Thermodynamics of Organic Compounds, 1987, https://doi.org/10.1007/978-94-009-3173-2
. [all data]
Sachek, Markovnik, et al., 1984
Sachek, A.I.; Markovnik, V.S.; Peshchenko, A.D.; Shvaro, A.V.; Andreevskii, D.N.,
Khim. Prom-st. (Moscow), 1984, 337. [all data]
Cabani, Conti, et al., 1975
Cabani, Sergio; Conti, G.; Mollica, V.; Lepori, L.,
Thermodynamic study of dilute aqueous solutions of organic compounds. Part 4.---Cyclic and straight chain secondary alcohols,
J. Chem. Soc., Faraday Trans. 1, 1975, 71, 0, 1943, https://doi.org/10.1039/f19757101943
. [all data]
Hovorka, Lankelma, et al., 1938
Hovorka, Frank; Lankelma, Herman P.; Stanford, Spencer C.,
Thermodynamic Properties of the Hexyl Alcohols. II. Hexanols-1, -2, -3 and 2-Methylpentanol-1 and -4,
J. Am. Chem. Soc., 1938, 60, 4, 820-827, https://doi.org/10.1021/ja01271a018
. [all data]
Haas and Harrison, 1993
Haas, M.J.; Harrison, A.G.,
The Fragmentation of Proton-Bound Cluster Ions and the Gas-Phase Acidities of Alcohols,
Int. J. Mass Spectrom. Ion Proc., 1993, 124, 2, 115, https://doi.org/10.1016/0168-1176(93)80003-W
. [all data]
Ashmore and Burgess, 1977
Ashmore, F.S.; Burgess, A.R.,
Study of Some Medium Size Alcohols and Hydroperoxides by Photoelectron Spectroscopy,
J. Chem. Soc. Faraday Trans. 2, 1977, 73, 1247. [all data]
Tudor, 1997
Tudor, E.,
Temperature dependence of the retention index for perfumery compounds on a SE-30 glass capillary column. I. Linear equations,
J. Chromatogr. A, 1997, 779, 1-2, 287-297, https://doi.org/10.1016/S0021-9673(97)00453-6
. [all data]
Cha and Lee, 1994
Cha, K.-W.; Lee, D.-J.,
Prediction of retention indices of various compounds in gas-liquid chromatography,
J. Korean Chem. Soc., 1994, 38, 2, 108-120, retrieved from http://journal.kcsnet.or.kr/publi/dh/dh94n2/108.pdf. [all data]
Boneva, 1987
Boneva, S.,
Gas Chromatographic Retention Indices for C6 Alkanols on OV-101 and Carbowax 20M Capillary Columns,
Chromatographia, 1987, 23, 1, 50-52, https://doi.org/10.1007/BF02310419
. [all data]
Bogoslovsky, Anvaer, et al., 1978
Bogoslovsky, Yu.N.; Anvaer, B.I.; Vigdergauz, M.S.,
Chromatographic constants in gas chromatography (in Russian), Standards Publ. House, Moscow, 1978, 192. [all data]
Pías and Gascó, 1975
Pías, J.B.; Gascó, L.,
GC Retention Data of Alcohols and Benzoyl Derivatives of Alcohols,
J. Chromatogr. - Chrom. Data, 1975, d14-d16. [all data]
Mira and Sanchez, 1970
Mira, J.M.; Sanchez, L.G.,
Polarity of the Gas Chromatographic Stationary Phases and Retention Indices of Aliphatic Esters, Ketones and Alcohols,
Anal. Chim. Acta., 1970, 50, 2, 315-321, https://doi.org/10.1016/0003-2670(70)80071-X
. [all data]
Takeoka, Flath, et al., 1990
Takeoka, G.R.; Flath, R.A.; Mon, T.R.; Teranishi, R.; Guentert, M.,
Volatile Constituents of Apricot (Prunus armeniaca),
J. Agric. Food Chem., 1990, 38, 2, 471-477, https://doi.org/10.1021/jf00092a031
. [all data]
Ohnishi and Shibamoto, 1984
Ohnishi, S.; Shibamoto, T.,
Volatile compounds from heated beef fat and beef fat with glycine,
J. Agric. Food Chem., 1984, 32, 5, 987-992, https://doi.org/10.1021/jf00125a008
. [all data]
Bonastre and Grenier, 1968
Bonastre, J.; Grenier, P.,
Contribution à l'étude de la polarité des phases stationnaires en chromatographie gaz-liquide. III. Calcul des coefficients d'activité relatifs et des indices de rétention de quelques alcools aliphatiques,
Bull. Soc. Chim. Fr., 1968, 1, 118-125. [all data]
Garruti, Franco, et al., 2001
Garruti, D.S.; Franco, M.R.B.; da Silva, M.A.A.A.P.; Janzantti, N.S.; Alves, G.L.,
Compostos voláteis do sabor de pseudofrutos de cajueiro anão precoce (Anacardium occidentale L.) CCP-76, Boletim de Pesquisa e Desenvolvimento 4, Empresa Brasileira de Pesquisa Agropecuária, Fortaleza, Brazil, 2001, 29, retrieved from http://www.cnpat.embrapa.br/publica/pub/BolPesq/pd4.pdf. [all data]
Tret'yakov, 2007
Tret'yakov, K.V.,
Retention Data. NIST Mass Spectrometry Data Center., NIST Mass Spectrometry Data Center, 2007. [all data]
Boué, Shih, et al., 2003
Boué, S.M.; Shih, B.Y.; Carter-Wientjes, C.H.; Cleveland, T.E.,
Identification of volatile compounds in soybean at various developmental stages using solid phase microextraction,
J. Agric. Food Chem., 2003, 51, 17, 4873-4876, https://doi.org/10.1021/jf030051q
. [all data]
Beaulieu and Grimm, 2001
Beaulieu, J.C.; Grimm, C.C.,
Identification of volatile compounds in cantaloupe at various developmental stages using solid phase microextraction,
J. Agric. Food Chem., 2001, 49, 3, 1345-1352, https://doi.org/10.1021/jf0005768
. [all data]
Matiella and Hsieh, 1990
Matiella, J.E.; Hsieh, T.C.-Y.,
Analysis of crabmeat volatile compounds,
J. Food Sci., 1990, 55, 4, 962-966, https://doi.org/10.1111/j.1365-2621.1990.tb01575.x
. [all data]
Tanchotikul and Hsieh, 1989
Tanchotikul, U.; Hsieh, T.C.-Y.,
Volatile Flavor Components in Crayfish Waste,
J. Food Sci., 1989, 54, 6, 1515-1520, https://doi.org/10.1111/j.1365-2621.1989.tb05149.x
. [all data]
Bianchi, Careri, et al., 2007
Bianchi, F.; Careri, M.; Mangia, A.; Musci, M.,
Retention indices in the analysis of food aroma volatile compounds in temperature-programmed gas chromatography: Database creation and evaluation of precision and robustness,
J. Sep. Sci., 2007, 39, 4, 563-572, https://doi.org/10.1002/jssc.200600393
. [all data]
Pennarun, Prost, et al., 2003
Pennarun, A.-L.; Prost, C.; Haure, J.; Demaimay, M.,
Comparison of two microalgal diets. 2. Influence on odorant composition and organoleptic qualities of raw oysters (Crassostrea gigas),
J. Agric. Food Chem., 2003, 51, 7, 2011-2018, https://doi.org/10.1021/jf020549c
. [all data]
Pennarun, Prost, et al., 2002
Pennarun, A.L.; Prost, C.; Demaimay, M.,
Identification and origin of the character-impact compounds of raw oyster Crassostrea gigas,
J. Sci. Food Agric., 2002, 82, 14, 1652-1660, https://doi.org/10.1002/jsfa.1236
. [all data]
Zhou and Wu, 2007
Zhou, L.; Wu, Q.,
Model of artificial neural network for quantitative structure-retention relations of saturated alcohols,
J. Southwest Univ. (Nat. Sci. Edn.), 2007, 33, 6, 1369-1372. [all data]
Radulovic, Dordevic, et al., 2010
Radulovic, N.; Dordevic, N.; Markovic, M.; Palic, R.,
Volatile constituents of Glechoma Hirsuta Waldst. Kit. and G. Hederacea L. (Lamiaceae),
Bull. Chem. Soc. Ethiop., 2010, 24, 1, 67-76, https://doi.org/10.4314/bcse.v24i1.52962
. [all data]
Joffraud, Leroi, et al., 2001
Joffraud, J.J.; Leroi, F.; Roy, C.; Berdagué, J.L.,
Characterisation of volatile compounds produced by bacteria isolated from the spoilage flora of cold-smoked salmon,
Int. J. Food Microbiol., 2001, 66, 3, 175-184, https://doi.org/10.1016/S0168-1605(00)00532-8
. [all data]
Boylston and Viniyard, 1998
Boylston, T.D.; Viniyard, B.T.,
Isolation of volatile flavor compounds from peanut butter using purge-and-trap technique
in Instrumental Methods in Food and Beverage Analysis, D. Wetzel and G. Charalambous, ed(s)., 1998, 225-243. [all data]
Binder, Benson, et al., 1990
Binder, R.G.; Benson, M.E.; Flath, R.A.,
Volatile Components of Safflower,
J. Agric. Food Chem., 1990, 38, 5, 1245-1248, https://doi.org/10.1021/jf00095a020
. [all data]
Binder and Flath, 1989
Binder, R.G.; Flath, R.A.,
Volatile components of pineapple guava,
J. Agric. Food Chem., 1989, 37, 3, 734-736, https://doi.org/10.1021/jf00087a034
. [all data]
Takeoka and Butter, 1989
Takeoka, G.; Butter, R.G.,
Volatile constituents of pineapple (Ananas Comosus [L.] Merr.)
in Flavor Chemistry. Trends and Developments, Teranishi,R.; Buttery,R.G.; Shahidi,F., ed(s)., American Chemical Society, Washington, DC, 1989, 223-237. [all data]
Habu, Flath, et al., 1985
Habu, T.; Flath, R.A.; Mon, T.R.; Morton, J.F.,
Volatile components of Rooibos tea (Aspalathus linearis),
J. Agric. Food Chem., 1985, 33, 2, 249-254, https://doi.org/10.1021/jf00062a024
. [all data]
del Rosario, de Lumen, et al., 1984
del Rosario, R.; de Lumen, B.O.; Habu, T.; Flath, R.A.; Mon, T.R.; Teranishi, R.,
Comparison of headspace volatiles from winged beans and soybeans,
J. Agric. Food Chem., 1984, 32, 5, 1011-1015, https://doi.org/10.1021/jf00125a015
. [all data]
Feng and Mu, 2007
Feng, H.; Mu, L.-L.,
Quantitative structure-retention relationships for alkane and its derivatives based on electrotopological state index and molecular shape index,
Chem. Ind. Engineering (Chinese), 2007, 24, 2, 161-168. [all data]
Kou, Zhang, et al., 2006
Kou, J.; Zhang, S.; Hu, Y.; Qiao, H.; Li, J.,
Stidy on the relationships between structures and gas chromatographic retention indices of alcohols,
Comput. Appl. Chem. (Chinese), 2006, 23, 7, 651-654. [all data]
Fu and Wang, 2004
Fu, S.-P.; Wang, Y.-Q.,
Estimation and prediction of gas chromatographic retention indices of alcohols by molecular electronegativity-distance vector,
J. Chongqing Univ., 2004, 27, 6, 106-109. [all data]
Begnaud, Pérès, et al., 2003
Begnaud, F.; Pérès, C.; Berdagué, J.-L.,
Characterization of volatile effluents of livestock buildings by solid-phase microextraction,
Int. J. Environ. Anal. Chem., 2003, 83, 10, 837-849, https://doi.org/10.1080/03067310310001603349
. [all data]
Junkes, Castanho, et al., 2003
Junkes, B.S.; Castanho, R.D.M.; Amboni, C.; Yunes, R.A.; Heinzen, V.E.F.,
Semiempirical Topological Index: A Novel Molecular Descriptor for Quantitative Structure-Retention Relationship Studies,
Internet Electronic Journal of Molecular Design, 2003, 2, 1, 33-49. [all data]
Spanier, Shahidi, et al., 2001
Spanier, A.M.; Shahidi, F.; Par; iment, T.H.; Mussinan, C.,
Food Flavors and Chemistry. Advances of the New Millenium, Royal Soc. Chem., 2001, 666. [all data]
Estrada and Gutierrez, 1999
Estrada, E.; Gutierrez, Y.,
Modeling chromatographic parameters by a novel graph theoretical sub-structural approach,
J. Chromatogr. A, 1999, 858, 2, 187-199, https://doi.org/10.1016/S0021-9673(99)00808-0
. [all data]
Guyot, Bouseta, et al., 1998
Guyot, C.; Bouseta, A.; Scheirman, V.; Collin, S.,
Floral origin markers of chestnut and lime tree honeys,
J. Agric. Food Chem., 1998, 46, 2, 625-633, https://doi.org/10.1021/jf970510l
. [all data]
Zenkevich, 1998
Zenkevich, I.G.,
The Principle of Structural Analogy in the Calculation of Gas Chromatographic Retention Indices using Physico-Chemical Constants of Organic Compounds,
Zh. Anal. Khim. (Rus.), 1998, 53, 1, 43-49. [all data]
Weller and Wolf, 1989
Weller, J.-P.; Wolf, M.,
Massenspektroskopie und Headspace-GC,
Beitr. Gerichtl. Med., 1989, 47, 525-532. [all data]
MacLeod and Snyder, 1988
MacLeod, A.J.; Snyder, C.H.,
Volatile components of mango preserved by deep freezing,
J. Agric. Food Chem., 1988, 36, 1, 137-139, https://doi.org/10.1021/jf00079a035
. [all data]
Karlsson, Birgersson, et al., 2009
Karlsson, M.F.; Birgersson, G.; Prado, A.M.C.; Bosa, F.; Bengtsson, M.; Witzgall, P.,
Plant Odor Analysis of Potato: Responce of Guatemalan Moth to Above- and Background Potato Volatiles,
J. Agric. Food Chem., 2009, 57, 13, 5903-5909, https://doi.org/10.1021/jf803730h
. [all data]
Seifert and King, 1982
Seifert, R.M.; King, A.D., Jr.,
Identification of some volatile constituents of Aspergillus clavatus,
J. Agric. Food Chem., 1982, 30, 4, 786-790, https://doi.org/10.1021/jf00112a044
. [all data]
Bardakci, Demirci, et al., 2012
Bardakci, H.; Demirci, B.; Yesilada, E.; Kirmizibekmez, H.; Naser, K.H.C.,
Chemical composition of the essential oil of the subterranean parts of Valeriana alliariifolia,
Rec. Nat. Prod., 2012, 6, 1, 89-92. [all data]
Berard, Bianchi, et al., 2007
Berard, J.; Bianchi, F.; Careri, M.; Chatel, A.; Mangia, A.; Musci, M.,
Characterization of the volatile fraction and of free fatty acids of Fontina Valle d'Aosta, a protected designation of origin Italian cheese,
Food Chem., 2007, 105, 1, 293-300, https://doi.org/10.1016/j.foodchem.2006.11.041
. [all data]
Narain, Galvao, et al., 2007
Narain, N.; Galvao, M. deS.; Ferreira, D.DaS.; Navarro, D.M.A.F.,
Flavor biogeneration in Mangaba (Hancornia speciosa Gomes) fruit,
BioEng. Campinas, 2007, 1, 1, 25-31. [all data]
Garruti, Franco, et al., 2003
Garruti, D.S.; Franco, M.R.B.; da Silva, M.A.A.P.; Janzantti, N.S.; Alves, G.L.,
Evaluation of volatile flavour compounds from cashew apple (Anacardium occidentale L) juice by the Osme gas chromatography/olfactometry technique,
J. Sci. Food Agric., 2003, 83, 14, 1455-1462, https://doi.org/10.1002/jsfa.1560
. [all data]
Caldentey, Daria Fumi, et al., 1998
Caldentey, P.; Daria Fumi, M.; Mazzoleni, V.; Careri, M.,
Volatile compounds produced by microorganisms isolated from cork,
Flavour Fragr. J., 1998, 13, 3, 185-188, https://doi.org/10.1002/(SICI)1099-1026(199805/06)13:3<185::AID-FFJ723>3.0.CO;2-W
. [all data]