1,4-Benzenedicarbonitrile
- Formula: C8H4N2
- Molecular weight: 128.1308
- IUPAC Standard InChIKey: BHXFKXOIODIUJO-UHFFFAOYSA-N
- CAS Registry Number: 623-26-7
- Chemical structure:

Gas phase thermochemistry data

Data compiled by: Hussein Y. Afeefy, Joel F. Liebman, and Stephen E. Stein
Quantity | Value | Units | Method | Reference | Comment |
---|---|---|---|---|---|
ΔfH°gas | 358.3 ± 2.2 | kJ/mol | Ccb | Acree, Tucker, et al., 1992 | Author was aware that data differs from previously reported values |
ΔfH°gas | 357.1 ± 1.9 | kJ/mol | Ccb | Sato-Toshima, Sakiyama, et al., 1980 |

Condensed phase thermochemistry data

Data compiled as indicated in comments:
ALS - Hussein Y. Afeefy, Joel F. Liebman, and Stephen E. Stein
DH - Eugene S. Domalski and Elizabeth D. Hearing
Quantity | Value | Units | Method | Reference | Comment |
---|---|---|---|---|---|
ΔfH°solid | 268.5 ± 1.2 | kJ/mol | Ccb | Acree, Tucker, et al., 1992 | Author was aware that data differs from previously reported values; ALS |
ΔfH°solid | 268.3 ± 1.2 | kJ/mol | Ccb | Sato-Toshima, Sakiyama, et al., 1980 | ALS |
Quantity | Value | Units | Method | Reference | Comment |
ΔcH°solid | -3988.2 ± 0.6 | kJ/mol | Ccb | Acree, Tucker, et al., 1992 | Author was aware that data differs from previously reported values; ALS |
ΔcH°solid | -3988.04 ± 0.59 | kJ/mol | Ccb | Sato-Toshima, Sakiyama, et al., 1980 | ALS |
Quantity | Value | Units | Method | Reference | Comment |
S°solid,1 bar | 183.0 | J/mol*K | N/A | Lebedev, Bykova, et al., 1988 | DH |
Constant pressure heat capacity of solid
Cp,solid (J/mol*K) | Temperature (K) | Reference | Comment |
---|---|---|---|
161.2 | 298.15 | Lebedev, Bykova, et al., 1988 | T = 0 to 330 K.; DH |

Phase change data

Data compiled as indicated in comments:
TRC - Thermodynamics Research Center, NIST Boulder Laboratories, Chris Muzny director
ALS - Hussein Y. Afeefy, Joel F. Liebman, and Stephen E. Stein
DRB - Donald R. Burgess, Jr.
AC - William E. Acree, Jr., James S. Chickos
Quantity | Value | Units | Method | Reference | Comment |
---|---|---|---|---|---|
Ttriple | 450.15 | K | N/A | Lebedev, Bykova, et al., 1988 | Uncertainty assigned by TRC = 1. K; TRC |
Quantity | Value | Units | Method | Reference | Comment |
ΔsubH° | 89.3 ± 0.9 | kJ/mol | AVG | N/A | Average of 6 values; Individual data points |

Gas phase ion energetics data

Data evaluated as indicated in comments:
HL - Edward P. Hunter and Sharon G. Lias
Data compiled as indicated in comments:
LLK - Sharon G. Lias, Rhoda D. Levin, and Sherif A. Kafafi
B - John E. Bartmess
Quantity | Value | Units | Method | Reference | Comment |
---|---|---|---|---|---|
Proton affinity (review) | 779.0 | kJ/mol | N/A | Hunter and Lias, 1998 | HL |
Quantity | Value | Units | Method | Reference | Comment |
Gas basicity | 751.8 | kJ/mol | N/A | Hunter and Lias, 1998 | HL |
Electron affinity determinations
EA (eV) | Method | Reference | Comment |
---|---|---|---|
1.093 ± 0.087 | TDEq | Chowdhury and Kebarle, 1986 | ΔGea(423 K) = -25.8 kcal/mol; ΔSea = +1.0 eu.; B |
Ionization energy determinations
IE (eV) | Method | Reference | Comment |
---|---|---|---|
10.10 | PE | Neijzen and DeLange, 1978 | LLK |
10.1 | PE | Palmer, Moyes, et al., 1980 | Vertical value; LLK |
10.10 | PE | Neijzen and DeLange, 1978 | Vertical value; LLK |

References

Acree, Tucker, et al., 1992
Acree, W.E., Jr.; Tucker, S.A.; Pilcher, G.,
Enthalpies of combustion of 1,4-dicyanobenzene di-N-oxide and 1,4-dicyanobenzene: the mean dissociation enthalpy of the (N-O) bonds,
J. Chem. Thermodyn., 1992, 24, 213-216. [all data]
Sato-Toshima, Sakiyama, et al., 1980
Sato-Toshima, T.; Sakiyama, M.; Seki, S.,
Thermochemical estimation of destabilization energies of 1,2-, 1,3-, and 1,4-dicyanobenzenes due to interactions between substituents. Appendix: Dipole moments in solution of the dicyanobenzenes,
Bull. Chem. Soc. Jpn., 1980, 53, 2762-2767. [all data]
Lebedev, Bykova, et al., 1988
Lebedev, B.V.; Bykova, T.A.; Kiparisova, Y.G.; Mitina, L.M.; Pankratov, V.A.,
Calorimetric study of terephthalodinitrile, its polycyclotrimerization, and the resulting polytriazine in the range 0-330 K,
Vysokomol. Soedin., 1988, B30(3), 179-183. [all data]
Hunter and Lias, 1998
Hunter, E.P.; Lias, S.G.,
Evaluated Gas Phase Basicities and Proton Affinities of Molecules: An Update,
J. Phys. Chem. Ref. Data, 1998, 27, 3, 413-656, https://doi.org/10.1063/1.556018
. [all data]
Chowdhury and Kebarle, 1986
Chowdhury, S.; Kebarle, P.,
Electron affinities of di- and tetracyanoethylene and cyanobenzenes based on measurements of gas-phase electron transfer equilibria,
J. Am. Chem. Soc., 1986, 108, 5453. [all data]
Neijzen and DeLange, 1978
Neijzen, B.J.M.; DeLange, C.A.,
Photoelectron spectroscopy of mono-dicyanobenzenes their perfluoro derivatives,
J. Electron Spectrosc. Relat. Phenom., 1978, 14, 187. [all data]
Palmer, Moyes, et al., 1980
Palmer, M.H.; Moyes, W.; Spiers, M.,
The electronic structure of substituted benzenes: Ab initio calculations and photoelectron spectra for benzonitrile, the tolunitriles, fluorobenzonitriles, dicyanobenzenes and ethynylbenzene,
J. Mol. Struct., 1980, 62, 165. [all data]