Benzene, 1-chloro-4-methoxy-
- Formula: C7H7ClO
- Molecular weight: 142.583
- IUPAC Standard InChIKey: YRGAYAGBVIXNAQ-UHFFFAOYSA-N
- CAS Registry Number: 623-12-1
- Chemical structure:
View 3d structure (requires JavaScript / HTML 5) - Other names: Anisole, p-chloro-; p-Chloroanisole; p-Chloromethoxybenzene; p-Chlorophenyl methyl ether; Anisyl chloride; 1-Chloro-4-methoxybenzene; 4-Chloroanisole; 4-Chlorophenol methyl ether; para-Chloroanisole; 1-Methoxy-4-chlorobenzene; NSC 4129; p-Methoxychlorobenzene; p-chloroanisol

Phase change data

Data compiled as indicated in comments:
BS - Robert L. Brown and Stephen E. Stein
AC - William E. Acree, Jr., James S. Chickos
Quantity | Value | Units | Method | Reference | Comment |
---|---|---|---|---|---|
Tboil | 473.2 | K | N/A | Aldrich Chemical Company Inc., 1990 | BS |
Quantity | Value | Units | Method | Reference | Comment |
ΔvapH° | 54.8 ± 0.8 | kJ/mol | C | Ribeiro da Silva and Ferreira, 2008 | AC |

Gas phase ion energetics data

Data compiled as indicated in comments:
LBLHLM - Sharon G. Lias, John E. Bartmess, Joel F. Liebman, John L. Holmes, Rhoda D. Levin, and W. Gary Mallard
LLK - Sharon G. Lias, Rhoda D. Levin, and Sherif A. Kafafi
RDSH - Henry M. Rosenstock, Keith Draxl, Bruce W. Steiner, and John T. Herron
Ionization energy determinations
IE (eV) | Method | Reference | Comment |
---|---|---|---|
8.25 ± 0.03 | PI | Ponomarev, Arapov, et al., 1986 | LBLHLM |
7.79 | EI | Russell, Freiser, et al., 1983 | LBLHLM |
8.18 | EI | Cooks, Bertrand, et al., 1973 | LLK |
8.5 ± 0.1 | EI | Brown, 1970 | RDSH |
8.25 ± 0.15 | CTS | Voigt and Reid, 1964 | RDSH |
Appearance energy determinations
Ion | AE (eV) | Other Products | Method | Reference | Comment |
---|---|---|---|---|---|
C6H4ClO+ | 11.99 ± 0.05 | CH3 | PI | Ponomarev, Arapov, et al., 1986 | LBLHLM |
C6H4ClO+ | 11.8 ± 0.1 | CH3 | EI | Brown, 1970 | RDSH |
C6H5Cl+ | 11.42 | HCHO | EI | Cooks, Bertrand, et al., 1973 | LLK |
C6H5Cl+ | 11.6 ± 0.1 | CH2O | EI | Brown, 1970 | RDSH |
C6H7+ | 10.02 | ? | EI | Russell, Freiser, et al., 1983 | LBLHLM |
C7H7O+ | 10.42 | Cl | EI | Russell, Freiser, et al., 1983 | LBLHLM |

Kovats' RI, non-polar column, isothermal

View large format table.

Column type Active phase Temperature (C) I Reference Comment
PackedApolane150.1120.Evans and Haken, 1987He, Chromosorb G AW DCMS; Column length: 3.7 m
PackedApolane150.1120.Haken and Vernon, 1986Chromosorb G AW DCMS; Column length: 3.7 m
CapillarySE-30140.1090.Korhonen, 1984N2; Column length: 25. m; Column diameter: 0.3 mm
CapillarySE-30160.1094.Korhonen, 1984N2; Column length: 25. m; Column diameter: 0.3 mm
CapillarySE-30180.1108.Korhonen, 1984N2; Column length: 25. m; Column diameter: 0.3 mm

Kovats' RI, non-polar column, custom temperature program

View large format table.

Column type Active phase I Reference Comment
PackedApiezon M1131.7Jalali-Heravi and Garkani-Nejad, 1993Chromosorb W; Column length: 2. m; Program: not specified

Kovats' RI, polar column, isothermal

View large format table.

Column type Active phase Temperature (C) I Reference Comment
PackedCarbowax 20M150.1592.Haken and Vernon, 1986Chromosorb G AW DCMS; Column length: 3.7 m; Column diameter: 6.4 mm
CapillaryOV-351140.1648.Korhonen, 1984N2; Column length: 25. m; Column diameter: 0.32 mm
CapillaryOV-351160.1656.Korhonen, 1984N2; Column length: 25. m; Column diameter: 0.32 mm
CapillaryOV-351180.1645.Korhonen, 1984N2; Column length: 25. m; Column diameter: 0.32 mm

Van Den Dool and Kratz RI, non-polar column, temperature ramp

View large format table.

Column type Active phase I Reference Comment
CapillaryOV-11079.5Gautzsch and Zinn, 19968. K/min; Tstart: 35. C; Tend: 300. C
CapillarySE-301093.Korhonen, 1984N2, 10. K/min; Column length: 25. m; Column diameter: 0.3 mm; Tstart: 100. C
CapillarySE-301082.Korhonen, 1984N2, 2. K/min; Column length: 25. m; Column diameter: 0.3 mm; Tstart: 100. C
CapillarySE-301090.Korhonen, 1984N2, 6. K/min; Column length: 25. m; Column diameter: 0.3 mm; Tstart: 100. C

Van Den Dool and Kratz RI, non-polar column, custom temperature program

View large format table.

Column type Active phase I Reference Comment
CapillaryVF-5MS1123.5Tret'yakov, 200730. m/0.25 mm/0.25 μm, He; Program: Multi-step temperature program; T(initial)=60C; T(final)=270C

Van Den Dool and Kratz RI, polar column, temperature ramp

View large format table.

Column type Active phase I Reference Comment
CapillaryOV-3511630.Korhonen, 1984N2, 10. K/min; Column length: 25. m; Column diameter: 0.32 mm; Tstart: 100. C
CapillaryOV-3511607.Korhonen, 1984N2, 2. K/min; Column length: 25. m; Column diameter: 0.32 mm; Tstart: 100. C
CapillaryOV-3511613.Korhonen, 1984N2, 6. K/min; Column length: 25. m; Column diameter: 0.32 mm; Tstart: 100. C

Normal alkane RI, non-polar column, temperature ramp

View large format table.

Column type Active phase I Reference Comment
CapillaryUltra-11077.Okumura, 199125. m/0.32 mm/0.25 μm, He, 3. K/min; Tstart: 80. C; Tend: 260. C

References

Aldrich Chemical Company Inc., 1990
Aldrich Chemical Company Inc.,
Catalog Handbook of Fine Chemicals, Aldrich Chemical Company, Inc., Milwaukee WI, 1990, 1. [all data]
Ribeiro da Silva and Ferreira, 2008
Ribeiro da Silva, Manuel A.V.; Ferreira, Ana I.M.C. Lobo,
Standard molar enthalpies of formation of the three isomers of chloroanisole,
The Journal of Chemical Thermodynamics, 2008, 40, 3, 362-368, https://doi.org/10.1016/j.jct.2007.10.001
. [all data]
Ponomarev, Arapov, et al., 1986
Ponomarev, D.A.; Arapov, O.V.; Sergeev, Y.L.; Chistyakov, A.B.,
[Title unavailable],
Izv. Vyssh. Uchebn. Zaved., Khim. Khim. Tekhnol., 1986, 29, 107. [all data]
Russell, Freiser, et al., 1983
Russell, D.H.; Freiser, B.S.; McBay, E.H.; Canada, D.C.,
The structure of decomposing [C7H7O]+ ions: Benzyl versus tropylium ion structures,
Org. Mass Spectrom., 1983, 18, 474. [all data]
Cooks, Bertrand, et al., 1973
Cooks, R.G.; Bertrand, M.; Beynon, J.H.; Rennekamp, M.E.; Setser, D.W.,
Energy partitioning data as an ion structure probe. Substituted anisoles,
J. Am. Chem. Soc., 1973, 95, 1732. [all data]
Brown, 1970
Brown, P.,
Kinetic studies in mass spectrometry. VIII. Competing [M-CH3] and [M-CH2O] reactions in substituted anisoles. Approximate activation energies from ionization appearance potentials,
Org. Mass Spectrom., 1970, 4, 519. [all data]
Voigt and Reid, 1964
Voigt, E.M.; Reid, C.,
Ionization potentials of substituted benzenes and their charge-transfer spectra with tetracyanoethylene,
J. Am. Chem. Soc., 1964, 86, 3930. [all data]