Benzenamine, N,4-dimethyl-
- Formula: C8H11N
- Molecular weight: 121.1796
- IUPAC Standard InChIKey: QCIFLGSATTWUQJ-UHFFFAOYSA-N
- CAS Registry Number: 623-08-5
- Chemical structure:
View 3d structure (requires JavaScript / HTML 5) - Other names: p-Toluidine, N-methyl-; p,N-Dimethylaniline; N-Methyl-p-toluidine; N-Methyl-4-methylaniline; N,p-Dimethylaniline; N,4-Dimethylbenzenamine

Reaction thermochemistry data

Data compiled by: Hussein Y. Afeefy, Joel F. Liebman, and Stephen E. Stein
Individual Reactions
By formula: C8H11N = 0.5C7H9N + 0.5C9H13N
Quantity | Value | Units | Method | Reference | Comment |
---|---|---|---|---|---|
ΔrH° | -1. | kJ/mol | Kin | Kachurin, Matvienko, et al., 1980 | liquid phase |

Gas phase ion energetics data

Data compiled as indicated in comments:
LLK - Sharon G. Lias, Rhoda D. Levin, and Sherif A. Kafafi
RDSH - Henry M. Rosenstock, Keith Draxl, Bruce W. Steiner, and John T. Herron
Ionization energy determinations
IE (eV) | Method | Reference | Comment |
---|---|---|---|
7.13 | PE | Cowling and Johnstone, 1973 | LLK |
7.6 ± 0.1 | EI | Eland, Shepherd, et al., 1966 | RDSH |

References

Kachurin, Matvienko, et al., 1980
Kachurin, O.I.; Matvienko, N.M.; Chekhuta, V.G.,
N-Methylated p-toluidines,
Russ. Chem. Rev., 1980, 46, 64-67. [all data]
Cowling and Johnstone, 1973
Cowling, S.A.; Johnstone, R.A.W.,
Photoelectron spectroscopy: The effects of steric inhibition to resonance in anilines,
J. Electron Spectrosc. Relat. Phenom., 1973, 2, 161. [all data]
Eland, Shepherd, et al., 1966
Eland, J.H.D.; Shepherd, P.J.; Danby, C.J.,
Ionization potentials of aromatic molecules determined by analytical interpretation of electron impact data,
Z. Naturforsch., 1966, 21a, 1580. [all data]