Benzonitrile, 4-chloro-
- Formula: C7H4ClN
- Molecular weight: 137.566
- IUPAC Standard InChIKey: GJNGXPDXRVXSEH-UHFFFAOYSA-N
- CAS Registry Number: 623-03-0
- Chemical structure:
View 3d structure (requires JavaScript / HTML 5) - Other names: Benzonitrile, p-chloro-; p-Chlorobenzonitrile; p-Cyanochlorobenzene; 4-Chlorobenzonitrile; Nitril kyseliny p-chlorbenzoove; p-Chlorocyanobenzene; 4-Chlorobenzoic acid nitrile

Phase change data

Data compiled as indicated in comments:
BS - Robert L. Brown and Stephen E. Stein
AC - William E. Acree, Jr., James S. Chickos
Quantity | Value | Units | Method | Reference | Comment |
---|---|---|---|---|---|
Tboil | 496.2 | K | N/A | Aldrich Chemical Company Inc., 1990 | BS |
Enthalpy of vaporization
ΔvapH (kJ/mol) | Temperature (K) | Method | Reference | Comment |
---|---|---|---|---|
51.9 | 404. | EB | Aim, 1994 | Based on data from 389. to 483. K.; AC |

Gas phase ion energetics data

Data compiled by: Henry M. Rosenstock, Keith Draxl, Bruce W. Steiner, and John T. Herron
Ionization energy determinations
IE (eV) | Method | Reference |
---|---|---|
9.94 ± 0.05 | EI | Buchs, 1970 |
Appearance energy determinations
Ion | AE (eV) | Other Products | Method | Reference | Comment |
---|---|---|---|---|---|
C7H4N+ | 14.0 ± 0.1 | Cl | EI | Brown, 1970 |

References

Aldrich Chemical Company Inc., 1990
Aldrich Chemical Company Inc.,
Catalog Handbook of Fine Chemicals, Aldrich Chemical Company, Inc., Milwaukee WI, 1990, 1. [all data]
Aim, 1994
Aim, Karel,
A modified ebulliometric method for high-boiling substances: vapour pressures of 2-chlorobenzonitrile and 4-chlorobenzonitrile at temperatures from 380 K to 490 K,
The Journal of Chemical Thermodynamics, 1994, 26, 9, 977-986, https://doi.org/10.1006/jcht.1994.1115
. [all data]
Buchs, 1970
Buchs, A.,
Etude par spectrometrie de masse de l'ionisation de benzonitriles, de phenylacetonitriles et de N,N-dimethylanilines substitues,
Helv. Chim. Acta, 1970, 53, 2026. [all data]
Brown, 1970
Brown, P.,
Kinetic studies in mass spectrometry-IV. The [M - Cl] reaction in substituted chlorobenzenes and the question of molecular ion isomerization,
Org. Mass Spectrom., 1970, 3, 639. [all data]