1-Propanol, 3-(diethylamino)-
- Formula: C7H17NO
- Molecular weight: 131.2160
- IUPAC Standard InChIKey: WKCYFSZDBICRKL-UHFFFAOYSA-N
- CAS Registry Number: 622-93-5
- Chemical structure:
View 3d structure (requires JavaScript / HTML 5) - Other names: N,N-Diethyl-3-hydroxypropylamine; 3-(Diethylamino)-1-propanol; 3-(Diethylamino)propanol; 3-(Diethylamino)propyl alcohol; γ-Diaethylaminopropanol; Diethylpropanolamine; 3-diethylaminopropan-1-ol

Phase change data

Data compiled by: Robert L. Brown and Stephen E. Stein
Quantity | Value | Units | Method | Reference | Comment |
---|---|---|---|---|---|
Tboil | 462.7 | K | N/A | Weast and Grasselli, 1989 | |
Tboil | 462.6 | K | N/A | Buckingham and Donaghy, 1982 |
Reduced pressure boiling point
Tboil (K) | Pressure (bar) | Reference |
---|---|---|
355.2 | 0.020 | Aldrich Chemical Company Inc., 1990 |
357. | 0.027 | Buckingham and Donaghy, 1982 |

Gas phase ion energetics data

Data compiled by: Sharon G. Lias, Rhoda D. Levin, and Sherif A. Kafafi
Ionization energy determinations
IE (eV) | Method | Reference | Comment |
---|---|---|---|
8.56 ± 0.05 | PE | Leavell, Steichen, et al., 1973 | Vertical value |

References

Weast and Grasselli, 1989
CRC Handbook of Data on Organic Compounds, 2nd Editon, Weast,R.C and Grasselli, J.G., ed(s)., CRC Press, Inc., Boca Raton, FL, 1989, 1. [all data]
Buckingham and Donaghy, 1982
Buckingham, J.; Donaghy, S.M.,
Dictionary of Organic Compounds: Fifth Edition, Chapman and Hall, New York, 1982, 1. [all data]
Aldrich Chemical Company Inc., 1990
Aldrich Chemical Company Inc.,
Catalog Handbook of Fine Chemicals, Aldrich Chemical Company, Inc., Milwaukee WI, 1990, 1. [all data]
Leavell, Steichen, et al., 1973
Leavell, S.; Steichen, J.; Franklin, J.L.,
Photoelectron spectra of intramolecularly hydrogen bonded compounds,
J. Chem. Phys., 1973, 59, 4343. [all data]