Benzene, (2-chloroethoxy)-
- Formula: C8H9ClO
- Molecular weight: 156.609
- IUPAC Standard InChIKey: VQUYNUJARXBNPK-UHFFFAOYSA-N
- CAS Registry Number: 622-86-6
- Chemical structure:
View 3d structure (requires JavaScript / HTML 5) - Other names: Phenetole, β-chloro-; β-Chlorophenetole; (2-Chloroethoxy)benzene; 1-Phenoxy-2-chloroethane; 2-Chloroethyl phenyl ether; 2-Phenoxyethyl chloride; β-Phenoxyethyl chloride

Gas phase ion energetics data

Data compiled by: Sharon G. Lias, Rhoda D. Levin, and Sherif A. Kafafi
Ionization energy determinations
IE (eV) | Method | Reference |
---|---|---|
8.50 | EI | Russell, Gross, et al., 1979 |
Appearance energy determinations
Ion | AE (eV) | Other Products | Method | Reference | Comment |
---|---|---|---|---|---|
C6H6O+ | 10.80 | C2H3Cl | EI | Russell, Gross, et al., 1979 |

Van Den Dool and Kratz RI, non-polar column, temperature ramp

Column type | Active phase | I | Reference | Comment |
---|---|---|---|---|
Capillary | OV-1 | 1190.2 | Gautzsch and Zinn, 1996 | 8. K/min; Tstart: 35. C; Tend: 300. C |

References

Russell, Gross, et al., 1979
Russell, D.H.; Gross, M.L.; Van der Greef, J.; Nibbering, N.M.M.,
The chemistry of C6H6O radical cations: A study of rearrangement reactions of halogen substituted ethyl phenyl ethers,
Org. Mass Spectrom., 1979, 14, 474. [all data]
Gautzsch and Zinn, 1996
Gautzsch, R.; Zinn, P.,
Use of incremental models to estimate the retention indexes of aromatic compounds,
Chromatographia, 1996, 43, 3/4, 163-176, https://doi.org/10.1007/BF02292946
. [all data]