Benzenamine, N-propyl-
- Formula: C9H13N
- Molecular weight: 135.2062
- IUPAC Standard InChIKey: CDZOGLJOFWFVOZ-UHFFFAOYSA-N
- CAS Registry Number: 622-80-0
- Chemical structure:

Phase change data

Data compiled by: Robert L. Brown and Stephen E. Stein
Quantity | Value | Units | Method | Reference | Comment |
---|---|---|---|---|---|
Tboil | 495.2 | K | N/A | Weast and Grasselli, 1989 |
Reduced pressure boiling point
Tboil (K) | Pressure (atm) | Reference |
---|---|---|
373.2 | 0.014 | Weast and Grasselli, 1989 |

Gas phase ion energetics data

Data compiled by: Henry M. Rosenstock, Keith Draxl, Bruce W. Steiner, and John T. Herron
Ionization energy determinations
IE (eV) | Method | Reference |
---|---|---|
7.54 | CTS | Farrell and Newton, 1965 |
7.5 | CTS | Briegleb and Czekalla, 1959 |

References

Weast and Grasselli, 1989
CRC Handbook of Data on Organic Compounds, 2nd Editon, Weast,R.C and Grasselli, J.G., ed(s)., CRC Press, Inc., Boca Raton, FL, 1989, 1. [all data]
Farrell and Newton, 1965
Farrell, P.G.; Newton, J.,
Ionization potentials of aromatic amines,
J. Phys. Chem., 1965, 69, 3506. [all data]
Briegleb and Czekalla, 1959
Briegleb, G.; Czekalla, J.,
Die Bestimmung von lonisierungsenergien aus den Spektren von Elektronenubergangskomplexen,
Z.Elektrochem., 1959, 63, 6. [all data]