Benzene, 1-butynyl-
- Formula: C10H10
- Molecular weight: 130.1864
- IUPAC Standard InChIKey: FFFMSANAQQVUJA-UHFFFAOYSA-N
- CAS Registry Number: 622-76-4
- Chemical structure:
View 3d structure (requires JavaScript / HTML 5) - Other names: 1-Butyne, 1-phenyl-; 1-Butynylbenzene; Ethylphenylacetylene; 1-Ethyl-2-phenylacetylene; 1-Phenyl-1-butyne; Phenylethylacetylene

Gas phase thermochemistry data

Data compiled by: Hussein Y. Afeefy, Joel F. Liebman, and Stephen E. Stein
Quantity | Value | Units | Method | Reference | Comment |
---|---|---|---|---|---|
ΔfH°gas | 248.6 ± 1.0 | kJ/mol | Chyd | Davis, Allinger, et al., 1985 |

Phase change data

Data compiled as indicated in comments:
BS - Robert L. Brown and Stephen E. Stein
TRC - Thermodynamics Research Center, NIST Boulder Laboratories, Chris Muzny director
Quantity | Value | Units | Method | Reference | Comment |
---|---|---|---|---|---|
Tboil | 475.2 | K | N/A | Weast and Grasselli, 1989 | BS |
Tboil | 473. | K | N/A | Gilman and Hoyle, 1922 | Uncertainty assigned by TRC = 5. K; TRC |
Tboil | 463.6 | K | N/A | Moureu and Andre, 1914 | Uncertainty assigned by TRC = 3. K; TRC |
Reduced pressure boiling point
Tboil (K) | Pressure (bar) | Reference | Comment |
---|---|---|---|
347.2 | 0.005 | Aldrich Chemical Company Inc., 1990 | BS |
353. | 0.013 | Farchan Laboratories, 1990 | BS |

Reaction thermochemistry data

Data compiled by: Hussein Y. Afeefy, Joel F. Liebman, and Stephen E. Stein
Individual Reactions
By formula: 2H2 + C10H10 = C10H14
Quantity | Value | Units | Method | Reference | Comment |
---|---|---|---|---|---|
ΔrH° | -262.3 ± 0.67 | kJ/mol | Chyd | Davis, Allinger, et al., 1985 | liquid phase; solvent: Hexane |

Gas phase ion energetics data

Data compiled as indicated in comments:
LBLHLM - Sharon G. Lias, John E. Bartmess, Joel F. Liebman, John L. Holmes, Rhoda D. Levin, and W. Gary Mallard
LLK - Sharon G. Lias, Rhoda D. Levin, and Sherif A. Kafafi
Ionization energy determinations
IE (eV) | Method | Reference | Comment |
---|---|---|---|
8.30 | PI | Domnin, Lakshin, et al., 1985 | LBLHLM |
8.37 ± 0.08 | PE | Elbel, Lienert, et al., 1981 | LLK |
8.5 | EI | Koppel, Schwarz, et al., 1974 | LLK |
8.33 ± 0.02 | PE | Carlier and Mouvier, 1979 | Vertical value; LLK |
Appearance energy determinations
Ion | AE (eV) | Other Products | Method | Reference | Comment |
---|---|---|---|---|---|
C9H7+ | 9.52 | CH3 | PI | Domnin, Lakshin, et al., 1985 | LBLHLM |

Kovats' RI, non-polar column, isothermal

Column type | Active phase | Temperature (C) | I | Reference | Comment |
---|---|---|---|---|---|
Capillary | SE-30 | 130. | 1129. | Bredael, 1982 | Column length: 100. m; Column diameter: 0.5 mm |
Capillary | SE-30 | 80. | 1118. | Bredael, 1982 | Column length: 100. m; Column diameter: 0.5 mm |

Lee's RI, non-polar column, custom temperature program

Column type | Active phase | I | Reference | Comment |
---|---|---|---|---|
Capillary | DB-5MS | 191.4 | Aracil, Font, et al., 2005 | Column length: 60. m; Column diameter: 0.25 mm; Program: not specified |

References

Davis, Allinger, et al., 1985
Davis, H.E.; Allinger, N.L.; Rogers, D.W.,
Enthalpies of hydrogenation of phenylalkynes: indirect determination of the enthalpy of formation of diphenylcyclopropenone,
J. Org. Chem., 1985, 50, 3601-3604. [all data]
Weast and Grasselli, 1989
CRC Handbook of Data on Organic Compounds, 2nd Editon, Weast,R.C and Grasselli, J.G., ed(s)., CRC Press, Inc., Boca Raton, FL, 1989, 1. [all data]
Gilman and Hoyle, 1922
Gilman, H.; Hoyle, R.E.,
A New Method for the Introduction of An Ethyl Group. The Reaction Between Organomagnesium Halides and Diethyl SUlfate,
J. Am. Chem. Soc., 1922, 44, 2621. [all data]
Moureu and Andre, 1914
Moureu, C.; Andre, E.,
Thermochemistry of Acetylenic Compounds,
Ann. Chim. (Paris), 1914, 1, 113. [all data]
Aldrich Chemical Company Inc., 1990
Aldrich Chemical Company Inc.,
Catalog Handbook of Fine Chemicals, Aldrich Chemical Company, Inc., Milwaukee WI, 1990, 1. [all data]
Farchan Laboratories, 1990
Farchan Laboratories,
Research Chemicals Catalog, Farchan Laboratories, Gainesville, FL, 1990, 91. [all data]
Domnin, Lakshin, et al., 1985
Domnin, I.N.; Lakshin, A.M.; Misharev, A.D.; Orlov, V.M.; Takhistov, V.V.,
Thermochemical investigation of some hydrocarbon ions generated by photoionization,
J. Org. Chem. USSR, 1985, 21, 1149. [all data]
Elbel, Lienert, et al., 1981
Elbel, S.; Lienert, K.; Krebs, A.; tom Dieck, H.,
Phenylethin - mustersonde fur substituenteneffekte,
Liebigs Ann. Chem., 1981, 1785. [all data]
Koppel, Schwarz, et al., 1974
Koppel, C.; Schwarz, H.; Bohlmann, F.,
Elektronenstossinduzierte fragmentierung von acetylenverbindungen,
Org. Mass Spectrom., 1974, 9, 324. [all data]
Carlier and Mouvier, 1979
Carlier, P.; Mouvier, G.,
Etude par spectrometrie de photoelectrons de la structure electronique des phenyl-alcynes conjugues,
J. Electron Spectrosc. Relat. Phenom., 1979, 16, 169-181. [all data]
Bredael, 1982
Bredael, P.,
Retention indices of hydrocarbons on SE-30,
J. Hi. Res. Chromatogr. Chromatogr. Comm., 1982, 5, 6, 325-328, https://doi.org/10.1002/jhrc.1240050610
. [all data]
Aracil, Font, et al., 2005
Aracil, I.; Font, R.; Conesa, J.A.,
Semivolatile and volatile compounds from the pyrolysis and combustion of polyvinyl chloride,
J. Anal. Appl. Pyrolysis, 2005, 74, 1-2, 465-478, https://doi.org/10.1016/j.jaap.2004.09.008
. [all data]