Phenol, 4-ethoxy-
- Formula: C8H10O2
- Molecular weight: 138.1638
- IUPAC Standard InChIKey: LKVFCSWBKOVHAH-UHFFFAOYSA-N
- CAS Registry Number: 622-62-8
- Chemical structure:
View 3d structure (requires JavaScript / HTML 5) - Other names: Phenol, p-ethoxy-; p-Ethoxyphenol; p-Hydroxyphenetole; Hydroquinone monoethyl ether; 4-Ethoxyphenol; 4-Ethyloxyphenol; Ether monoethylique de l'hydroquinone; NSC 9885

Phase change data

Data compiled by: Robert L. Brown and Stephen E. Stein
Quantity | Value | Units | Method | Reference | Comment |
---|---|---|---|---|---|
Tboil | 519.7 | K | N/A | Weast and Grasselli, 1989 | |
Tboil | 519. to 520. | K | N/A | Buckingham and Donaghy, 1982 | |
Quantity | Value | Units | Method | Reference | Comment |
Tfus | 339. to 340. | K | N/A | Buckingham and Donaghy, 1982 |
Reduced pressure boiling point
Tboil (K) | Pressure (bar) | Reference |
---|---|---|
394.2 | 0.01 | Aldrich Chemical Company Inc., 1990 |

Gas phase ion energetics data

Data compiled by: Henry M. Rosenstock, Keith Draxl, Bruce W. Steiner, and John T. Herron
Ionization energy determinations
IE (eV) | Method | Reference |
---|---|---|
8.25 ± 0.15 | EI | McLafferty and Schiff, 1969 |
Appearance energy determinations
Ion | AE (eV) | Other Products | Method | Reference | Comment |
---|---|---|---|---|---|
C6H6O2+ | 10.84 ± 0.15 | C2H4 | EI | McLafferty and Schiff, 1969 |

Normal alkane RI, non-polar column, custom temperature program

Column type | Active phase | I | Reference | Comment |
---|---|---|---|---|
Capillary | SE-30 | 1350. | Vinogradov, 2004 | Program: not specified |

References

Weast and Grasselli, 1989
CRC Handbook of Data on Organic Compounds, 2nd Editon, Weast,R.C and Grasselli, J.G., ed(s)., CRC Press, Inc., Boca Raton, FL, 1989, 1. [all data]
Buckingham and Donaghy, 1982
Buckingham, J.; Donaghy, S.M.,
Dictionary of Organic Compounds: Fifth Edition, Chapman and Hall, New York, 1982, 1. [all data]
Aldrich Chemical Company Inc., 1990
Aldrich Chemical Company Inc.,
Catalog Handbook of Fine Chemicals, Aldrich Chemical Company, Inc., Milwaukee WI, 1990, 1. [all data]
McLafferty and Schiff, 1969
McLafferty, F.W.; Schiff, L.J.,
The structure of [YC6H5O]+ ions in the spectra of aryl alkyl ethers,
Org. Mass Spectrom., 1969, 2, 757. [all data]
Vinogradov, 2004
Vinogradov, B.A.,
Production, composition, properties and application of essential oils, 2004, retrieved from http://viness.narod.ru. [all data]