Benzene, 1-chloro-4-ethoxy-
- Formula: C8H9ClO
- Molecular weight: 156.609
- IUPAC Standard InChIKey: IXLSVQMYQRAMEW-UHFFFAOYSA-N
- CAS Registry Number: 622-61-7
- Chemical structure:
View 3d structure (requires JavaScript / HTML 5) - Other names: Phenetole, p-chloro-; p-Chlorophenetole; p-Chlorophenyl ethyl ether; 4-Chlorophenol ethyl ether; 1-Chloro-4-ethoxybenzene; p-Ethoxychlorobenzene; 4-Chlorophenetole; NSC 6161

Phase change data

Data compiled as indicated in comments:
TRC - Thermodynamics Research Center, NIST Boulder Laboratories, Chris Muzny director
AC - William E. Acree, Jr., James S. Chickos
Quantity | Value | Units | Method | Reference | Comment |
---|---|---|---|---|---|
Tboil | 485.09 | K | N/A | Dreisbach and Martin, 1949 | Uncertainty assigned by TRC = 0.07 K; TRC |
Quantity | Value | Units | Method | Reference | Comment |
Tfus | 290.29 | K | N/A | Dreisbach and Martin, 1949 | Uncertainty assigned by TRC = 0.05 K; TRC |
Enthalpy of vaporization
ΔvapH (kJ/mol) | Temperature (K) | Method | Reference | Comment |
---|---|---|---|---|
49.5 | 410. | A | Stephenson and Malanowski, 1987 | Based on data from 395. to 485. K. See also Stull, 1947.; AC |
Antoine Equation Parameters
log10(P) = A − (B / (T + C))
P = vapor pressure (bar)
T = temperature (K)
View plot Requires a JavaScript / HTML 5 canvas capable browser.
Temperature (K) | A | B | C | Reference | Comment |
---|---|---|---|---|---|
395.16 to 485.09 | 4.24874 | 1722.075 | -79.206 | Dreisbach and Shrader, 1949 | Coefficents calculated by NIST from author's data. |

Gas phase ion energetics data

Data compiled by: Henry M. Rosenstock, Keith Draxl, Bruce W. Steiner, and John T. Herron
Ionization energy determinations
IE (eV) | Method | Reference |
---|---|---|
8.46 ± 0.15 | EI | McLafferty and Schiff, 1969 |
Appearance energy determinations
Ion | AE (eV) | Other Products | Method | Reference | Comment |
---|---|---|---|---|---|
C6H5OCl+ | 10.77 ± 0.15 | C2H4 | EI | McLafferty and Schiff, 1969 |

Van Den Dool and Kratz RI, non-polar column, temperature ramp

Column type | Active phase | I | Reference | Comment |
---|---|---|---|---|
Capillary | OV-1 | 1157.6 | Gautzsch and Zinn, 1996 | 8. K/min; Tstart: 35. C; Tend: 300. C |

References

Dreisbach and Martin, 1949
Dreisbach, R.R.; Martin, R.A.,
Physical Data on Some Organic Compounds,
Ind. Eng. Chem., 1949, 41, 2875-8. [all data]
Stephenson and Malanowski, 1987
Stephenson, Richard M.; Malanowski, Stanislaw,
Handbook of the Thermodynamics of Organic Compounds, 1987, https://doi.org/10.1007/978-94-009-3173-2
. [all data]
Stull, 1947
Stull, Daniel R.,
Vapor Pressure of Pure Substances. Organic and Inorganic Compounds,
Ind. Eng. Chem., 1947, 39, 4, 517-540, https://doi.org/10.1021/ie50448a022
. [all data]
Dreisbach and Shrader, 1949
Dreisbach, R.R.; Shrader, S.A.,
Vapor Pressure--Temperature Data on Some Organic Compounds,
Ind. Eng. Chem., 1949, 41, 12, 2879-2880, https://doi.org/10.1021/ie50480a054
. [all data]
McLafferty and Schiff, 1969
McLafferty, F.W.; Schiff, L.J.,
The structure of [YC6H5O]+ ions in the spectra of aryl alkyl ethers,
Org. Mass Spectrom., 1969, 2, 757. [all data]
Gautzsch and Zinn, 1996
Gautzsch, R.; Zinn, P.,
Use of incremental models to estimate the retention indexes of aromatic compounds,
Chromatographia, 1996, 43, 3/4, 163-176, https://doi.org/10.1007/BF02292946
. [all data]