N-(4-Iodophenyl)acetamide
- Formula: C8H8INO
- Molecular weight: 261.0597
- IUPAC Standard InChIKey: SIULLDWIXYYVCU-UHFFFAOYSA-N
- CAS Registry Number: 622-50-4
- Chemical structure:
View 3d structure (requires JavaScript / HTML 5) - Other names: 4-Iodoacetanilide; p-Iodoacetanilide; Acetamide, N-(4-iodophenyl)-; Acetanilide, 4'-iodo-; 4'-Iodoacetanilide

Gas phase ion energetics data

Data compiled by: Sharon G. Lias, Rhoda D. Levin, and Sherif A. Kafafi
Ionization energy determinations
IE (eV) | Method | Reference |
---|---|---|
7.87 ± 0.03 | EI | Benezra and Bursey, 1971 |
Appearance energy determinations
Ion | AE (eV) | Other Products | Method | Reference | Comment |
---|---|---|---|---|---|
C2H3O+ | 13.16 ± 0.03 | ? | EI | Benezra and Bursey, 1971 | |
C6H6NI+ | 9.72 ± 0.03 | CH2=C=O | EI | Benezra and Bursey, 1971 |

References

Benezra and Bursey, 1971
Benezra, S.A.; Bursey, M.M.,
ortho-Effects on ordering factors in mass spectral rearrangements. Loss of keten from halogenated phenyl acetates and acetanilides,
J. Chem. Soc. B, 1971, 1515. [all data]