Thorium, chlorotris](1,2,3,4,5-η5)-1-methyl-2,4-cyclopentadien-1-yl]-

Gas phase ion energetics data

Data compiled by: Sharon G. Lias, Rhoda D. Levin, and Sherif A. Kafafi

Ionization energy determinations

IE (eV) Method Reference Comment
7.75PEFragala, Ciliberto, et al., 1976Vertical value

References

Fragala, Ciliberto, et al., 1976
Fragala, I.; Ciliberto, E.; Fischer, R.D.; Sienel, G.R.; Zanella, P., Photoelectron spectroscopy of f-element organometallic compounds II. Tricyclopentadienyl derivatives of uranium(IV) thorium (IV)., J. Organomet. Chem., 1976, 120, 9. [all data]