Benzene, 1-ethoxy-3-nitro-
- Formula: C8H9NO3
- Molecular weight: 167.1620
- IUPAC Standard InChIKey: LFOLBPDHVGDKGJ-UHFFFAOYSA-N
- CAS Registry Number: 621-52-3
- Chemical structure:

Gas phase ion energetics data

Data compiled by: Henry M. Rosenstock, Keith Draxl, Bruce W. Steiner, and John T. Herron
Ionization energy determinations
IE (eV) | Method | Reference |
---|---|---|
9.11 ± 0.15 | EI | McLafferty and Schiff, 1969 |
Appearance energy determinations
Ion | AE (eV) | Other Products | Method | Reference | Comment |
---|---|---|---|---|---|
C6H5NO3+ | 10.91 ± 0.15 | C2H4 | EI | McLafferty and Schiff, 1969 |

References

McLafferty and Schiff, 1969
McLafferty, F.W.; Schiff, L.J.,
The structure of [YC6H5O]+ ions in the spectra of aryl alkyl ethers,
Org. Mass Spectrom., 1969, 2, 757. [all data]