Benzene, 1-isocyanato-3-methyl-
- Formula: C8H7NO
- Molecular weight: 133.1473
- IUPAC Standard InChIKey: CPPGZWWUPFWALU-UHFFFAOYSA-N
- CAS Registry Number: 621-29-4
- Chemical structure:
View 3d structure (requires JavaScript / HTML 5) - Other names: m-Isocyanatotoluene; Isocyanic acid, m-tolyl ester; m-Methylphenyl isocyanate; 3-Methylphenyl isocyanate; m-Tolyl isocyanate; 3-Tolyl isocyanate

Reaction thermochemistry data

Data compiled by: Hussein Y. Afeefy, Joel F. Liebman, and Stephen E. Stein
Individual Reactions
+
= C16H26N2O
By formula: C8H19N + C8H7NO = C16H26N2O
Quantity | Value | Units | Method | Reference | Comment |
---|---|---|---|---|---|
ΔrH° | -103.3 ± 0.8 | kJ/mol | Cm | Kiselev, Malkov, et al., 1989 | liquid phase; solvent: Dioxane |
By formula: C15H16N2O = C7H9N + C8H7NO
Quantity | Value | Units | Method | Reference | Comment |
---|---|---|---|---|---|
ΔrH° | 126.2 ± 1.7 | kJ/mol | Eqk | Chimishkyan, Svetlova, et al., 1984 | solid phase; Dissociation |
By formula: C10H14N2O = C2H7N + C8H7NO
Quantity | Value | Units | Method | Reference | Comment |
---|---|---|---|---|---|
ΔrH° | 109.9 | kJ/mol | Eqk | Chimishkyan, Svetlova, et al., 1984 | solid phase; Dissociation |

Gas phase ion energetics data

Data compiled by: Sharon G. Lias, Rhoda D. Levin, and Sherif A. Kafafi
Ionization energy determinations
IE (eV) | Method | Reference | Comment |
---|---|---|---|
8.7 ± 0.1 | PE | Neijzen and DeLange, 1980 | Vertical value |
8.83 | PE | Kobayashi and Nagakura, 1975 | Vertical value |

References

Kiselev, Malkov, et al., 1989
Kiselev, V.D.; Malkov, V.B.; Murzin, D.G.; Shakirov, I.M.; Konovalov, A.I.,
Thermochemical study of the reaction of isocyanate with amines,
Dokl. Phys. Chem. (Engl. Transl.), 1989, 308, 711-713, In original 111. [all data]
Chimishkyan, Svetlova, et al., 1984
Chimishkyan, A.L.; Svetlova, L.P.; Leonova, T.V.; Gluyaev, N.D.,
Thermal decomposition of substituted ureas,
J. Gen. Chem. USSR, 1984, 54, 1317-1320. [all data]
Neijzen and DeLange, 1980
Neijzen, B.J.M.; DeLange, C.A.,
Photoelectron spectroscopy of some thiocyanates, isocyanates and isothiocyanates,
J. Electron Spectrosc. Relat. Phenom., 1980, 18, 179. [all data]
Kobayashi and Nagakura, 1975
Kobayashi, T.; Nagakura, S.,
Photoelectron spectra of phenyl isocyanates and phenyl isothio- cyanate,
J. Electron Spectrosc. Relat. Phenom., 1975, 7, 488. [all data]